program: Gaussian 09
title: 000278731
version: EM64L-G09RevD.01
frameworkgroup: C1[X(C14H6N2O7)]
method: RPBEPBE
basis: SDD
operation: Freq
keyword: #p
keyword: freq=noraman
keyword: PBEPBE/SDD
title: #p freq=noraman PBEPBE/SDD
converged: YES YES NO NO
title: Mulliken charges:
elementType: O O O O O O O N N C C C C C C C C C C C C C C H H H H H H
charge: -0.126117 -0.393353 -0.168647 -0.199075 -0.218819 -0.182029 -0.184649 0.013305 0.018752 0.198754 0.337901 0.234045 0.017619 -0.241654 0.306090 0.237712 -0.603303 -0.361248 0.459893 -0.531002 -0.380200 -0.224896 0.087200 0.341885 0.309383 0.333125 0.275600 0.250150 0.393578
chargesum: 0.00000
title: Mulliken charges with hydrogens summed into heavy atoms:
elementType: O O O O O O O N N C C C C C C C C C C C C C C
charge: -0.126117 0.000226 -0.168647 -0.199075 -0.218819 -0.182029 -0.184649 0.013305 0.018752 0.198754 0.337901 0.234045 0.017619 -0.241654 0.306090 0.237712 -0.261418 -0.051865 0.459893 -0.197878 -0.104599 0.025254 0.087200
polarizability: 3.33261550e+02 -1.57265125e+01 2.38873953e+02 2.81030026e+00 -1.47437867e+00 7.91464184e+01
1716.lowfreq: -5.1947 0.0005 0.0006 0.0008 0.1010 5.7518 37.0030 38.3688 46.2246
frequency: 36.9967 38.3615 46.2236 52.7190 63.1532 100.3112 119.2930 154.7917 162.2323 172.0336 178.2966 195.6125 244.0378 284.0868 291.2277 325.3449 327.2250 337.4476 367.0073 410.5215 439.2604 472.7118 510.8276 522.4925 531.4572 539.8682 579.0384 605.6229 622.8347 627.0957 651.0961 677.9910 693.0088 703.2050 720.5936 725.1737 735.8229 770.1036 798.0186 827.1828 835.8804 841.7398 892.5216 950.0125 961.5966 965.8007 978.1142 1006.6485 1015.8461 1053.3259 1076.4734 1088.2983 1155.9312 1170.0158 1177.1517 1197.8514 1204.5937 1217.4329 1233.7226 1256.9563 1327.0973 1351.6719 1375.0990 1389.1400 1393.5810 1413.3917 1439.9618 1468.3342 1473.3419 1574.1320 1585.6704 1596.9015 1615.3024 1636.3487 1644.5868 3152.8281 3172.3144 3179.5350 3186.6499 3207.5759 3521.4532
redmass: 12.3193 9.7094 11.0782 14.9345 11.4609 9.4423 9.8586 6.6165 7.3347 6.7819 9.3651 5.4641 8.6183 11.4040 8.2511 7.0759 10.1727 10.5408 7.1604 6.9914 5.1652 5.5267 5.3604 5.1647 6.7435 3.0005 2.7639 2.7847 6.6512 4.5818 6.7796 7.1653 7.6324 5.6618 7.8960 4.8777 9.1161 2.8308 8.1272 2.4558 7.7774 4.1084 9.6202 1.4161 6.8293 1.5112 1.5564 1.4013 5.7941 3.0142 2.1826 1.7373 3.9784 2.2753 1.6196 2.1678 6.3943 4.2253 3.0424 2.1975 2.8683 4.2081 10.7277 11.7622 5.2969 3.0075 4.1987 4.1322 4.9968 8.0702 8.9440 7.3935 8.6837 10.7215 10.6090 1.0884 1.0965 1.0937 1.0920 1.0946 1.0642
irintensity: 0.7496 0.5287 1.4455 0.1330 0.9905 3.8136 5.1120 0.8765 1.5594 4.0790 3.0294 1.2329 0.2044 3.0195 1.0946 0.8472 0.4300 4.0285 2.8827 2.2027 0.4365 6.6905 6.5602 11.4509 13.4337 28.3463 33.4416 72.1445 10.2350 34.6114 11.7791 8.6886 20.1176 8.9713 4.1613 47.3264 13.1329 32.4987 3.3150 9.0477 5.0064 26.7459 17.3265 0.4700 26.8454 17.7405 16.5651 2.4012 93.0011 124.9458 41.3018 41.6882 8.3512 47.1940 25.2223 149.4548 237.9341 299.1167 11.9653 14.3009 76.7664 29.1877 55.8367 19.8141 84.4305 40.1097 16.5973 24.0562 24.4285 67.0977 17.0029 21.6566 158.1488 160.1169 166.3651 3.6550 6.0736 12.2011 24.0350 5.6131 51.3288
temp: 298.150 k
press: 1.00000 atm
elementType: 8 8 8 8 8 8 8 7 7 6 6 6 6 6 6 6 6 6 6 6 6 6 6 1 1 1 1 1 1
symmnumber: 1
zpe: 476383.8 jmol-1
zpe.correction: 0.181445 hartree
zpe.thermalcorrener: 0.199823 hartree
zpe.thermalcorrenthalpy: 0.200767 hartree
zpe.thermalcorrgfe: 0.133174 hartree
zpe.sumelectzpe: -1171.422254 hartree
zpe.sumelectthermal: -1171.403876 hartree
zpe.sumelectthermalent: -1171.402932 hartree
zpe.sumelectthermalfe: -1171.470525 hartree
dipole: -4.0497 1.9222 0.9641
dipole: 4.5853
quadrupole: -150.0495 -139.1663 -129.8962
quadrupole: -3.5140 -6.0169 -5.5825
quadrupole: -10.3455 0.5377 9.8078 -3.5140 -6.0169 -5.5825
hfenergy: -1171.603699 hartree
pointgroup: C01 [X(C14H6N2O7)]
dipole: 1.6136823 0.741351 -0.3174959 debye
polarizability: 333.408199|13.9783184|238.1889289|9.6962961|6.3043065|79.6847929 unknown
InChI: InChI=1S/C14H6N2O7/c17-13-9-4-6(15(20)21)5-10(16(22)23)11(9)7-2-1-3-8(12(7)13)14(18)19/h1-5,18H
charge 0 multiplicity 1
29 atoms
O  1.304612 -2.563442 0.175181
O  3.876284 -2.023602 -1.042388
O  -3.014298 3.164289 0.323831
O  -0.944544 3.435791 -0.581963
O  5.181107 -1.362172 0.767315
O  -3.998373 -2.992575 -0.131729
O  -5.19987 -1.049978 -0.17099
N  -1.890544 2.702114 -0.103475
N  -4.091162 -1.706696 -0.136989
C  -0.421405 0.595252 -0.035003
C  1.007967 1.036354 0.051592
C  -0.432257 -0.8384 -0.034813
C  1.844844 -0.130554 0.041292
C  0.978553 -1.356809 0.046388
C  -1.692574 1.227221 -0.071824
C  3.248217 -0.02505 0.116397
C  -1.588769 -1.616824 -0.06863
C  1.595433 2.313149 0.174867
C  -2.823965 -0.93003 -0.099847
C  -2.890327 0.470666 -0.091996
C  3.822772 1.262523 0.288747
C  3.002428 2.409028 0.315578
C  4.187575 -1.191887 0.025453
H  -1.54413 -2.709352 -0.063207
H  0.987385 3.216975 0.156962
H  -3.858651 0.977886 -0.101449
H  4.909355 1.349643 0.386675
H  3.460508 3.396251 0.43244
H  4.478228 -2.816568 -1.044813
