program: Gaussian 09
title: 000280267
version: EM64L-G09RevD.01
frameworkgroup: C1[X(C13H19NO2)]
method: RPBEPBE
basis: SDD
operation: Freq
keyword: #p
keyword: freq=noraman
keyword: PBEPBE/SDD
title: #p freq=noraman PBEPBE/SDD
converged: YES YES NO NO
title: Mulliken charges:
elementType: O O N C C C C C C C C C C C C C H H H H H H H H H H H H H H H H H H H
charge: -0.311013 -0.262372 -0.488223 0.164504 0.146114 0.171577 0.397233 0.399376 -0.718013 -0.855413 -0.835003 -0.847650 -0.847991 0.248937 -0.207020 -0.675420 0.232167 0.245913 0.247429 0.232116 0.278053 0.228132 0.224957 0.227959 0.229799 0.233718 0.235733 0.227572 0.230461 0.328193 0.225377 0.225948 0.210970 0.227441 0.228438
chargesum: 0.00000
title: Mulliken charges with hydrogens summed into heavy atoms:
elementType: O O N C C C C C C C C C C C C C
charge: -0.311013 -0.262372 -0.160031 0.164504 0.146114 0.171577 0.397233 0.399376 -0.485846 -0.129955 -0.103861 -0.156174 -0.154225 0.248937 0.244306 -0.008571
polarizability: 2.08602737e+02 6.85238183e-01 1.70768759e+02 -4.91681632e+00 2.62009153e+00 9.97779739e+01
1716.lowfreq: -3.1699 0.0001 0.0004 0.0006 6.4160 10.7667 29.2990 51.8195 59.5247
frequency: 29.2913 51.8171 59.5121 70.0327 95.0952 116.3803 124.1808 133.9845 158.8669 164.8118 174.3489 190.1767 207.6631 246.8985 267.0284 310.5706 317.6885 328.1524 346.3861 348.3893 356.8644 381.7950 437.8879 500.8675 543.1144 569.0554 585.9685 607.2805 633.0375 680.2218 697.2669 705.8010 755.9200 800.5771 825.3543 859.7757 878.9837 918.3820 970.4332 995.8499 1019.4364 1023.9514 1029.7187 1038.2754 1047.0343 1051.7537 1057.6668 1084.4118 1103.7730 1117.4076 1139.3981 1175.0923 1235.0419 1248.3316 1250.3680 1321.8587 1353.9611 1363.4090 1394.2974 1396.8161 1398.7039 1403.1769 1404.6795 1407.9294 1448.8605 1457.3485 1462.5772 1464.5050 1467.6002 1475.9357 1477.0215 1479.1753 1485.6007 1487.9332 1491.8533 1493.2877 1507.1986 1586.3527 1618.7945 1673.6890 2960.1796 2969.8420 2970.9940 2984.4871 2994.5558 3005.3667 3044.0022 3045.7978 3047.0417 3062.5213 3064.6987 3080.9570 3081.3783 3091.4454 3092.7297 3098.2000 3105.1683 3113.6557 3536.6445
redmass: 2.6748 2.8773 3.0429 2.9576 1.5858 2.2380 2.7880 2.7866 1.6064 1.1769 1.1087 1.5586 3.4185 1.1904 3.3496 2.7767 4.5458 3.1372 3.0867 3.2642 2.6355 3.5060 4.8874 4.6763 3.2759 1.9353 3.2953 1.6969 4.5401 4.7354 6.7617 5.3711 3.6890 1.0941 3.3096 3.1993 1.3216 2.7242 3.0817 1.3275 1.5172 1.4194 1.5097 2.6653 2.2646 1.6246 1.7052 2.6359 2.8216 2.4942 1.4629 2.7809 4.8248 1.1350 1.3745 4.9956 1.6063 3.3882 1.2434 1.2642 1.2853 1.2422 1.4445 2.1481 1.7318 1.1474 1.0409 1.1281 1.0987 1.1795 1.0791 1.2024 1.1013 1.0547 1.1338 1.0961 2.1191 5.9224 6.6012 8.8754 1.0458 1.0382 1.0384 1.0372 1.0358 1.0579 1.0939 1.0915 1.0961 1.1068 1.0964 1.0981 1.0988 1.0985 1.0985 1.0966 1.1024 1.0912 1.0756
irintensity: 0.2860 0.6296 0.9461 2.8140 0.7080 2.6208 2.2173 4.0220 4.3943 1.0424 0.1801 3.2305 2.4498 0.6704 2.2777 2.7552 5.8898 2.9257 8.0447 0.5144 0.4908 0.8114 0.5073 1.9891 3.8015 19.3414 0.3007 66.1980 5.9874 0.8562 19.2528 24.7155 6.7570 3.8020 2.9890 2.5158 9.8355 0.4446 119.8674 8.2507 17.3421 2.8095 16.3427 145.7976 31.9216 2.0042 5.6355 8.5037 77.9333 30.2579 4.8312 372.4571 3.9406 0.0354 0.4796 0.9723 30.8767 7.4386 0.8916 16.0252 26.2660 27.4855 0.4626 6.6315 117.5701 22.4456 11.6872 16.4876 11.9255 121.6446 9.9209 65.6022 27.7093 2.8129 23.7643 23.4291 116.4852 11.9279 8.8170 234.4434 39.1159 50.9812 26.5072 22.2073 24.3799 26.8523 37.4158 2.0545 24.2386 10.6046 10.2855 8.5400 40.2463 33.4311 18.9040 15.0292 45.8317 27.8100 26.7046
temp: 298.150 k
press: 1.00000 atm
elementType: 8 8 7 6 6 6 6 6 6 6 6 6 6 6 6 6 1 1 1 1 1 1 1 1 1 1 1 1 1 1 1 1 1 1 1
symmnumber: 1
zpe: 771230.1 jmol-1
zpe.correction: 0.293746 hartree
zpe.thermalcorrener: 0.311938 hartree
zpe.thermalcorrenthalpy: 0.312883 hartree
zpe.thermalcorrgfe: 0.247348 hartree
zpe.sumelectzpe: -710.791978 hartree
zpe.sumelectthermal: -710.773786 hartree
zpe.sumelectthermalent: -710.772842 hartree
zpe.sumelectthermalfe: -710.838376 hartree
dipole: 0.3085 -1.4872 -1.5791
dipole: 2.1910
quadrupole: -81.0420 -89.6813 -100.9590
quadrupole: -0.9239 -1.6450 -1.7975
quadrupole: 9.5188 0.8794 -10.3982 -0.9239 -1.6450 -1.7975
hfenergy: -711.0857242 hartree
pointgroup: C01 [X(C13H19N1O2)]
dipole: 0.1377357 0.505503 0.6844981 debye
polarizability: 208.0320852|-3.7919496|169.6458596|7.7005815|9.8702049|101.4715256 unknown
InChI: InChI=1S/C13H19NO2/c1-6-16-13(15)14-12-10(4)8(2)7-9(3)11(12)5/h7,14H,6H2,1-5H3
charge 0 multiplicity 1
35 atoms
O  3.217038 0.05557 0.405396
O  1.884357 -0.935241 -1.272175
N  0.965006 0.199144 0.596865
C  -0.441918 0.111765 0.304867
C  -1.174364 1.334934 0.245483
C  -1.057558 -1.160819 0.133433
C  -2.573557 1.27952 -0.000843
C  -2.452572 -1.195121 -0.157039
C  -3.177848 0.017344 -0.211718
C  -0.453671 2.660001 0.437179
C  -0.258255 -2.441231 0.27271
C  -3.423839 2.538762 -0.066706
C  -3.177447 -2.511001 -0.387864
C  1.985468 -0.292811 -0.198963
C  4.428496 -0.392642 -0.334468
C  5.634168 0.074003 0.47613
H  -4.253919 -0.021884 -0.423165
H  0.5296 2.655521 -0.066544
H  -1.037256 3.500393 0.029208
H  -0.273703 2.885925 1.508766
H  0.236557 -2.703953 -0.680869
H  0.543204 -2.32747 1.024066
H  -0.897871 -3.285903 0.577116
H  -3.347806 3.137906 0.860135
H  -3.121823 3.198004 -0.903744
H  -4.487031 2.284064 -0.214829
H  -2.699303 -3.106338 -1.187679
H  -3.185887 -3.142922 0.521652
H  -4.227084 -2.334731 -0.678646
H  1.268031 0.794659 1.370424
H  4.391981 -1.4925 -0.437896
H  4.407289 0.047334 -1.348314
H  6.567257 -0.235339 -0.02926
H  5.640926 1.173025 0.575913
H  5.623535 -0.367868 1.48728
