program: Gaussian 09
title: 000280327
version: EM64L-G09RevD.01
frameworkgroup: C1[X(C23H25N3O)]
method: RPBEPBE
basis: SDD
operation: Freq
keyword: #p
keyword: freq=noraman
keyword: PBEPBE/SDD
title: #p freq=noraman PBEPBE/SDD
converged: YES YES NO NO
title: Mulliken charges:
elementType: O N N N C C C C C C C C C C C C C C C C C C C C C C C H H H H H H H H H H H H H H H H H H H H H H H H H
charge: -0.319894 -0.461849 -0.464124 -0.082207 -0.304482 0.311826 0.273973 -0.482028 0.071442 0.035130 0.134679 0.139615 0.217131 0.201028 -0.416317 -0.368188 -0.821530 -0.816999 -0.361075 -0.377078 -0.671106 0.277007 -0.268721 -0.306117 -0.225638 -0.228400 -0.809063 0.202506 0.248482 0.272964 0.299950 0.295949 0.217318 0.277070 0.245254 0.217423 0.299294 0.286012 0.237306 0.219259 0.226904 0.225166 0.254099 0.250013 0.229924 0.217449 0.227197 0.219654 0.219125 0.264940 0.242369 0.227359
chargesum: 0.00000
title: Mulliken charges with hydrogens summed into heavy atoms:
elementType: O N N N C C C C C C C C C C C C C C C C C C C C C C C
charge: -0.319894 -0.161899 -0.168176 -0.082207 -0.101976 0.311826 0.273973 0.039418 0.071442 0.035130 0.134679 0.139615 0.217131 0.201028 -0.198999 -0.091118 -0.059559 -0.074422 -0.134172 -0.151912 0.062929 0.277007 -0.051272 -0.078920 -0.005984 -0.009275 -0.074395
polarizability: 3.59492112e+02 -1.78928684e+01 2.11958254e+02 4.40114664e+01 -5.72790641e+00 2.47132636e+02
1716.lowfreq: -51.4757 -12.2971 -5.7297 -0.0007 -0.0004 0.0004 11.9598 19.2554 33.6122
frequency: -51.2790 18.8746 33.5938 39.3041 50.7526 53.1713 74.5758 99.4229 106.8396 125.6128 128.8152 136.6370 139.3901 150.8770 156.7329 174.6474 187.9479 203.3500 244.1615 269.6671 282.5368 293.9023 296.4816 309.4812 334.4020 359.8904 375.2775 430.3888 433.5344 438.8997 482.5516 485.5686 487.1850 499.4148 511.5218 520.0969 544.8106 567.1896 574.5213 578.2024 580.9822 590.0230 608.5949 644.5411 653.1075 660.8873 668.6961 708.1195 730.0021 746.7037 753.1173 759.7878 768.2321 816.2746 846.4347 850.5972 852.0540 857.7160 900.4961 907.0640 925.0610 937.4561 942.6009 964.9872 976.4899 982.7264 988.9057 1002.4423 1010.3739 1012.4700 1027.5475 1030.6633 1036.3727 1041.9814 1059.5009 1104.0873 1108.3957 1116.3887 1131.6124 1142.3601 1154.4231 1168.8025 1179.8319 1206.0707 1225.7398 1234.9079 1239.5569 1242.2662 1262.0229 1289.3333 1305.3247 1313.0207 1332.3773 1337.5712 1353.9304 1357.9607 1373.9604 1395.0527 1398.6134 1401.4984 1408.5684 1411.8539 1419.4667 1427.4049 1439.6073 1458.6462 1462.9237 1465.1551 1466.7198 1467.3535 1468.2105 1481.2963 1481.7161 1482.5756 1484.6001 1486.3648 1488.6131 1502.2756 1561.0700 1573.3550 1578.5418 1581.0349 1588.6400 1629.2671 1630.9884 2953.3557 2960.3031 2965.1049 2965.8160 2971.1772 2987.5481 3030.1469 3042.0605 3045.8955 3075.1753 3084.2527 3093.3326 3112.0272 3113.2356 3120.3784 3125.1045 3125.2436 3130.1756 3133.2731 3139.1662 3150.9107 3159.8840 3163.6741 3599.8307 3600.9772
redmass: 1.0507 4.4078 4.3431 3.8612 4.5047 4.1506 3.5803 1.2744 3.0859 3.0105 3.4736 4.9572 3.2624 2.6853 1.3653 4.1424 2.6669 1.6942 2.1784 2.9722 3.2972 4.2782 4.1018 2.8576 4.3341 3.1717 3.7925 2.9602 4.0470 3.0709 5.3583 4.5516 4.1604 3.4645 1.2002 1.1966 4.0034 4.0791 3.6661 3.3766 3.2755 3.5584 5.6786 5.1314 5.1447 4.7715 4.9885 4.1423 3.7552 1.3965 1.4248 4.0570 4.0103 4.0954 1.4888 4.6286 3.8785 1.4226 2.8167 4.5431 1.3894 1.5041 2.5033 1.2948 1.8080 1.2925 1.6846 1.6827 2.1666 2.0420 2.2109 1.6656 1.4761 1.4806 2.6270 2.5591 1.9478 1.3576 1.6525 2.0727 1.8874 1.2373 1.2842 2.7474 1.7385 1.4927 1.7468 1.8224 2.2869 1.4320 3.3891 3.4118 1.5214 1.6211 1.4837 1.5182 1.2492 2.5201 2.0800 1.9919 1.9119 2.1054 2.1680 2.4987 1.1458 1.2686 1.8356 1.5282 2.1213 1.1445 1.4707 1.7286 1.8528 2.1016 1.1166 1.0797 1.0953 1.0858 6.3871 6.6166 5.6647 5.9389 5.9546 6.6529 6.6939 1.0761 1.0522 1.0586 1.0449 1.0413 1.0384 1.1008 1.0966 1.0935 1.0982 1.0982 1.0906 1.0946 1.0862 1.0858 1.0878 1.0945 1.0967 1.0898 1.0942 1.0947 1.0998 1.0992 1.0803 1.0803
irintensity: 0.1025 0.7411 0.7681 3.4236 0.9963 4.3762 2.2379 0.5397 3.4759 3.1382 0.4932 0.5297 2.5369 3.1298 0.5536 2.8369 2.6432 0.8351 3.5700 3.9672 0.4405 0.6010 0.4210 4.6243 0.6531 0.7941 0.9403 9.6863 4.2640 7.9296 0.8374 2.7466 5.0828 3.5313 74.2277 80.7426 8.2509 6.5402 10.0377 6.5441 15.2699 2.9499 8.9826 2.7732 4.4622 3.2540 1.7518 1.5607 10.2029 85.6241 80.9793 16.9930 9.6776 14.2229 0.1765 0.8082 2.8047 1.0038 1.2353 0.1880 2.1730 3.2988 2.3588 0.0800 1.3213 1.3958 3.2041 36.9370 3.4656 17.7593 29.3474 5.5108 8.0464 4.5131 12.0822 4.5712 2.5136 2.5846 10.4889 5.0244 22.4502 3.5828 3.5288 16.9269 24.6950 8.0739 30.7956 38.2041 32.9639 5.3749 22.6704 18.4442 8.0051 27.3780 11.5075 8.6895 22.1769 50.1977 10.9017 52.7780 8.9800 45.8981 17.9194 40.4493 42.2001 8.1595 31.1273 11.9946 8.4668 27.2155 12.4090 10.2491 20.5422 7.5068 12.7640 7.6221 10.0234 35.5953 9.0333 3.5763 62.1404 138.2373 15.6385 0.7702 2.5518 7.9935 35.5164 35.9252 77.5299 36.0757 11.1728 26.1337 18.7681 19.9593 15.6715 8.7611 10.0794 0.9205 13.7126 1.5429 2.4702 20.1187 6.4497 24.2475 38.0516 21.9035 36.7966 24.5919 46.1440 44.0201
temp: 298.150 k
press: 1.00000 atm
elementType: 8 7 7 7 6 6 6 6 6 6 6 6 6 6 6 6 6 6 6 6 6 6 6 6 6 6 6 1 1 1 1 1 1 1 1 1 1 1 1 1 1 1 1 1 1 1 1 1 1 1 1 1
symmnumber: 1
zpe: 1122771.0 jmol-1
zpe.correction: 0.427641 hartree
zpe.thermalcorrener: 0.452432 hartree
zpe.thermalcorrenthalpy: 0.453376 hartree
zpe.thermalcorrgfe: 0.372638 hartree
zpe.sumelectzpe: -1129.032028 hartree
zpe.sumelectthermal: -1129.007237 hartree
zpe.sumelectthermalent: -1129.006293 hartree
zpe.sumelectthermalfe: -1129.087032 hartree
dipole: -1.5233 -2.5696 -3.4044
dipole: 4.5291
quadrupole: -159.3022 -151.6182 -144.9125
quadrupole: -0.2750 -15.0647 -9.4071
quadrupole: -7.3579 0.3261 7.0318 -0.2750 -15.0647 -9.4071
hfenergy: -1129.4596693 hartree
pointgroup: C01 [X(C23H25N3O1)]
dipole: 0.5284413 -1.059518 1.3316501 debye
polarizability: 318.5814318|37.262245|222.6937021|64.1965348|20.1216058|277.3078679 unknown
InChI: InChI=1S/C23H25N3O/c1-14-22(17-9-5-7-11-20(17)24-14)19(13-26(4)16(3)27)23-15(2)25-21-12-8-6-10-18(21)23/h5-12,19,24-25H,13H2,1-4H3
charge 0 multiplicity 1
52 atoms
O  -2.752131 2.655766 -1.826141
N  3.352674 0.438822 -1.285084
N  -1.267321 -2.829015 0.934066
N  -2.057295 2.148518 0.337119
C  0.024211 0.654237 0.488332
C  1.470198 0.625604 -0.007635
C  -0.712508 -0.680572 0.375077
C  -0.678776 1.893231 -0.143269
C  2.618143 1.046983 0.781408
C  -1.709064 -1.168684 -0.576466
C  1.95409 0.26274 -1.273158
C  -0.471031 -1.725678 1.280214
C  3.789688 0.915172 -0.046657
C  -2.032654 -2.523676 -0.194515
C  2.776664 1.520853 2.112124
C  -2.364585 -0.628368 -1.721106
C  1.249227 -0.211084 -2.513092
C  0.455209 -1.782617 2.464685
C  5.085168 1.234953 0.412259
C  -2.959606 -3.324138 -0.896246
C  -2.278946 2.081821 1.788262
C  -3.024374 2.541261 -0.584822
C  4.066974 1.843912 2.577686
C  -3.290345 -1.42258 -2.425104
C  5.210607 1.702738 1.737431
C  -3.588932 -2.756925 -2.022346
C  -4.436065 2.821405 -0.069521
H  0.103167 0.865648 1.575262
H  -0.043414 2.77455 0.086745
H  -0.729496 1.815699 -1.239862
H  3.947455 0.238308 -2.08666
H  -1.270748 -3.71901 1.427921
H  1.909105 1.640734 2.772783
H  -2.179947 0.396033 -2.05741
H  1.029799 0.625637 -3.205341
H  1.859671 -0.948784 -3.067556
H  0.292226 -0.691959 -2.262308
H  1.399375 -1.254333 2.249344
H  0.009602 -1.315032 3.365322
H  0.710555 -2.825485 2.727683
H  5.965769 1.129047 -0.231736
H  -3.182969 -4.350125 -0.581015
H  -2.216896 1.038514 2.152106
H  -3.268805 2.479304 2.052046
H  -1.516721 2.686043 2.319674
H  4.198505 2.212252 3.601402
H  -3.795393 -1.000616 -3.301091
H  6.201007 1.963541 2.126884
H  -4.314481 -3.346886 -2.59362
H  -5.062957 3.043729 -0.945247
H  -4.862158 1.9513 0.461687
H  -4.465369 3.692409 0.611285
