program: Gaussian 09
title: 000278725
version: EM64L-G09RevD.01
frameworkgroup: C1[X(C19H18N2O4)]
method: RPBEPBE
basis: SDD
operation: Freq
keyword: #p
keyword: freq=noraman
keyword: PBEPBE/SDD
title: #p freq=noraman PBEPBE/SDD
converged: YES YES NO NO
title: Mulliken charges:
elementType: O O O O N N C C C C C C C C C C C C C C C C C C C H H H H H H H H H H H H H H H H H H
charge: -0.254392 -0.447687 -0.212433 -0.314343 -0.451956 -0.407726 -0.053050 -0.700878 0.319979 0.204484 0.271680 0.346828 -0.456642 -0.365287 -0.427597 -0.371944 -0.229869 -0.599246 -0.126107 -0.290486 0.217406 -0.239036 0.181795 0.281251 -0.774333 0.245293 0.243692 0.242959 0.255572 0.242084 0.301292 0.327238 0.226603 0.274830 0.275812 0.297995 0.237879 0.227520 0.364514 0.253653 0.220043 0.264243 0.398367
chargesum: 0.00000
title: Mulliken charges with hydrogens summed into heavy atoms:
elementType: O O O O N N C C C C C C C C C C C C C C C C C C C
charge: -0.254392 -0.049320 -0.212433 -0.314343 -0.124718 -0.043213 -0.053050 -0.211893 0.319979 0.204484 0.271680 0.346828 -0.213682 -0.109715 -0.185513 -0.070652 -0.003266 -0.048604 0.171888 -0.052608 0.217406 -0.011515 0.181795 0.281251 -0.036394
polarizability: 3.08187589e+02 2.94480600e+01 2.67645487e+02 -1.65784525e+01 2.31807864e+01 1.44105785e+02
1716.lowfreq: -7.3410 -5.0439 -0.0004 -0.0002 0.0003 3.6981 18.2961 28.7037 42.0639
frequency: 18.2074 28.6938 42.0532 60.5224 61.2513 73.5146 85.7052 90.7648 94.5758 103.3078 130.1279 153.0466 171.0725 200.6927 236.7244 239.5960 247.2859 279.0722 295.3960 315.7996 349.1529 358.1279 407.8101 417.8543 427.1586 469.3045 497.8520 511.0007 514.3803 539.1049 546.5642 554.7769 568.9325 580.8083 597.7138 625.2146 625.9493 629.9279 643.1516 672.7337 683.3476 714.5568 726.0553 746.4377 771.7643 782.0173 783.1104 795.3563 823.2432 838.7247 871.2914 884.9898 908.4055 930.9816 938.5767 953.2733 966.7669 969.8029 986.3550 989.7614 991.8434 999.7711 1023.5479 1041.7192 1045.3604 1074.5224 1079.6334 1107.5038 1133.4287 1137.6175 1170.6833 1178.1319 1182.8802 1188.5650 1205.9633 1219.6645 1230.9375 1238.8696 1252.7162 1264.4830 1299.3254 1308.3436 1314.3523 1330.3153 1346.7857 1377.0176 1391.4765 1396.1684 1414.5886 1429.2759 1449.3930 1450.4478 1454.7955 1463.4984 1464.4196 1481.0754 1489.8113 1515.7529 1586.1192 1591.2916 1595.3935 1612.4063 1616.9847 1623.2773 1679.3132 2981.6836 2988.8908 2998.7571 3025.5363 3032.7773 3096.4146 3105.0498 3105.4685 3120.3095 3124.7303 3130.4514 3141.5015 3153.0786 3162.4681 3194.3856 3537.3633 3537.9475 3543.4176
redmass: 5.8502 5.4515 5.9990 6.3620 6.1004 4.1100 8.3957 2.4991 1.8952 3.1245 4.1963 4.5386 4.6503 6.1227 5.3656 2.1845 5.4335 8.1270 4.9463 4.3287 3.4342 4.1507 3.6795 4.7181 3.0026 3.0482 4.0010 4.4256 2.9623 4.7759 4.4064 3.3311 3.5157 1.8399 2.8916 2.7808 6.0362 4.6434 1.7592 2.3582 1.3672 3.0653 4.7416 1.5039 3.9619 4.1656 2.0088 1.6727 4.9484 5.6073 1.3557 4.3137 1.4611 4.9938 1.5222 2.8207 1.8762 3.4195 1.3705 1.4374 4.6431 1.5968 3.3352 2.3533 1.6624 1.8641 1.8616 2.0761 1.1474 3.9346 1.5172 1.1983 1.3602 1.2209 1.9335 1.2816 1.6182 2.3507 1.7465 2.8330 2.2778 1.8907 1.5466 2.0613 1.4194 7.2452 1.2280 3.2314 2.7569 1.1748 2.3408 1.1103 1.1872 2.8647 1.1429 2.9409 2.0725 2.2385 5.9987 5.7399 6.6984 8.5573 6.8467 3.8020 9.5527 1.0610 1.0819 1.0359 1.0992 1.0606 1.0978 1.1023 1.1025 1.0874 1.0897 1.0876 1.0932 1.0959 1.0999 1.0946 1.0771 1.0775 1.0649
irintensity: 0.7842 1.4334 1.1854 6.2938 6.3326 12.9936 9.3944 0.6609 1.6058 0.8529 1.6273 4.3662 4.6182 0.7161 5.0061 10.2630 7.8722 1.7692 1.0224 2.8850 1.9430 1.0055 2.1416 0.4820 4.5683 1.6092 25.4488 20.9931 57.0369 2.9525 10.5924 23.1225 1.7330 18.6770 68.6404 3.6422 0.6683 52.6684 5.9176 180.3011 31.4108 3.8563 6.8378 105.4831 5.7082 4.7865 1.1022 57.8984 0.9685 2.9571 6.3318 8.2483 4.6419 9.2131 0.6886 3.6268 19.3350 37.1389 6.1195 0.3538 1.6697 0.1208 44.9722 8.1758 19.0041 191.3237 16.8125 1.1423 0.0243 12.2974 42.2632 0.4028 3.9113 3.2439 0.2265 7.3813 2.2282 6.9333 28.5609 7.8001 33.0783 27.8664 0.1777 19.0323 15.3657 28.1433 53.8501 6.7055 181.1476 9.1427 16.4360 7.7010 42.3642 62.6279 68.5772 11.2088 191.9599 385.3722 8.6152 57.4687 124.9422 137.4410 4.2964 63.0468 245.7084 15.3292 15.8568 7.0261 7.6809 5.9913 6.4518 4.1307 13.7383 3.8975 9.4014 5.0773 17.5857 28.5613 29.7145 4.9904 5.5120 107.7901 64.0059
temp: 298.150 k
press: 1.00000 atm
elementType: 8 8 8 8 7 7 6 6 6 6 6 6 6 6 6 6 6 6 6 6 6 6 6 6 6 1 1 1 1 1 1 1 1 1 1 1 1 1 1 1 1 1 1
symmnumber: 1
zpe: 879012.7 jmol-1
zpe.correction: 0.334798 hartree
zpe.thermalcorrener: 0.357174 hartree
zpe.thermalcorrenthalpy: 0.358119 hartree
zpe.thermalcorrgfe: 0.281425 hartree
zpe.sumelectzpe: -1143.507152 hartree
zpe.sumelectthermal: -1143.484776 hartree
zpe.sumelectthermalent: -1143.483832 hartree
zpe.sumelectthermalfe: -1143.560525 hartree
dipole: -1.2346 -1.2390 3.0797
dipole: 3.5418
quadrupole: -128.5338 -145.0121 -142.5357
quadrupole: -6.9665 10.4176 1.2474
quadrupole: 10.1600 -6.3182 -3.8418 -6.9665 10.4176 1.2474
hfenergy: -1143.8419502 hartree
pointgroup: C01 [X(C19H18N2O4)]
dipole: -0.4736513 0.4924149 -1.2144366 debye
polarizability: 306.4464946|-30.4346487|269.8194103|17.1233624|21.7496784|143.6729558 unknown
InChI: InChI=1S/C19H18N2O4/c1-11(22)20-16(19(24)25)10-17(23)21-15-8-4-6-13-9-12-5-2-3-7-14(12)18(13)15/h2-8,16,20-21,24H,9-10H2,1H3
charge 0 multiplicity 1
43 atoms
O  2.277557 -2.053733 0.255357
O  4.958835 -0.585165 -1.227939
O  5.492127 -0.817711 1.024173
O  1.521417 2.559936 0.154088
N  0.405749 -0.676235 0.662896
N  3.018487 1.109347 -0.869025
C  -1.960069 -0.855347 0.020725
C  -4.346653 -0.840187 -0.377386
C  -3.071605 -1.668678 -0.358929
C  -2.44114 0.538243 0.210179
C  -3.858557 0.549531 -0.004005
C  -0.674876 -1.458222 0.161947
C  -2.920374 -3.033552 -0.652567
C  -1.776847 1.75855 0.501967
C  -4.604072 1.733924 0.110242
C  -0.517026 -2.834998 -0.154624
C  -1.627826 -3.604137 -0.562813
C  2.622902 0.067803 1.408455
C  3.640809 0.673233 0.390295
C  -2.534265 2.948607 0.615017
C  1.757481 -0.996003 0.728623
C  -3.937083 2.94203 0.432463
C  4.774546 -0.322313 0.135352
C  1.99985 2.037211 -0.908599
C  1.474734 2.396643 -2.291791
H  -5.093062 -1.227455 0.344193
H  -4.834872 -0.850299 -1.371647
H  -3.78123 -3.643796 -0.946916
H  -0.689186 1.853299 0.599251
H  -5.687986 1.727336 -0.054175
H  0.474657 -3.28343 -0.076401
H  0.15722 0.247811 1.021477
H  -1.479365 -4.663472 -0.7993
H  3.202206 -0.411672 2.217162
H  2.028263 0.894007 1.826998
H  4.099203 1.547152 0.896697
H  -2.016184 3.887942 0.836507
H  -4.504652 3.874482 0.526266
H  3.367699 0.6727 -1.725687
H  1.620698 3.477442 -2.462328
H  1.962635 1.836257 -3.107019
H  0.388139 2.205641 -2.324836
H  5.663618 -1.275718 -1.346147
