program: Gaussian 09
title: 000278760
version: EM64L-G09RevD.01
frameworkgroup: C1[X(C25H26Cl2N4O2)]
method: RPBEPBE
basis: SDD
operation: Freq
keyword: #p
keyword: freq=noraman
keyword: PBEPBE/SDD
title: #p freq=noraman PBEPBE/SDD
converged: YES YES NO NO
title: Mulliken charges:
elementType: Cl Cl O O N N N N C C C C C C C C C C C C C C C C C C C C C C C C C H H H H H H H H H H H H H H H H H H H H H H H H H H
charge: -0.064714 -0.062695 -0.266208 -0.302461 -0.129428 -0.507821 -0.415846 0.049066 -0.419563 -0.420393 0.459169 -0.347670 -0.365030 -0.554621 -0.554869 0.475528 -0.406969 -0.421339 0.300589 0.078946 -0.400188 0.427663 -0.372542 -0.302924 0.215063 -0.389021 -0.410339 -0.225263 -0.300044 -0.352505 -0.332205 0.316392 -0.537978 0.274018 0.239683 0.275779 0.236582 0.224491 0.221497 0.265490 0.292481 0.263893 0.290284 0.279635 0.219519 0.199892 0.372151 0.265997 0.192372 0.263271 0.251049 0.226726 0.228563 0.283896 0.239110 0.250325 0.218988 0.220128 0.244401
chargesum: 0.00000
title: Mulliken charges with hydrogens summed into heavy atoms:
elementType: Cl Cl O O N N N N C C C C C C C C C C C C C C C C C C C C C C C C C
charge: -0.064714 -0.062695 -0.266208 -0.302461 -0.129428 -0.135670 -0.131951 0.049066 0.094137 0.091969 0.459169 -0.123180 -0.143533 0.003350 -0.000693 0.475528 -0.127334 -0.201820 0.300589 0.078946 -0.200296 0.427663 -0.106545 -0.110551 0.215063 -0.125750 -0.159291 0.001463 -0.071481 -0.113395 -0.081880 0.316392 0.145539
polarizability: 7.55220727e+02 1.35712261e+01 3.80797523e+02 -9.25068871e+00 2.27928251e+01 1.90620435e+02
1716.lowfreq: -6.8917 -1.7293 -0.0018 -0.0010 -0.0009 1.8859 6.8501 13.5978 17.7712
frequency: 4.4138 13.5465 17.2997 22.4743 35.3060 36.8819 42.0439 51.5459 55.9154 73.2420 82.7960 91.2978 95.4715 103.8094 116.7825 123.4469 138.3080 149.3117 173.3690 178.0974 187.6738 212.4533 217.3417 235.4648 239.5565 254.4655 271.9671 304.9066 329.8215 343.9496 375.5378 379.5545 385.8708 394.5069 414.3298 421.1647 427.2200 430.4262 445.0866 454.0884 485.5655 502.6957 514.8943 515.6693 518.9258 541.8633 557.4052 573.1669 599.6211 600.9246 605.9834 614.1360 634.5385 635.7940 669.2704 674.0841 700.2548 712.2035 736.8551 738.1695 746.8093 761.8563 802.1387 806.0119 806.5725 823.2213 829.8405 829.9285 853.3843 855.2263 865.8126 871.7355 878.3623 904.3505 919.5069 921.4679 924.4793 938.5912 947.8196 951.4465 957.2645 982.3908 984.4240 988.9352 996.3559 999.4959 1008.4725 1020.5425 1028.6225 1049.8920 1050.9236 1099.3005 1112.8008 1113.0439 1138.0401 1147.6828 1156.3913 1162.2898 1175.3299 1176.1608 1180.3028 1180.5053 1201.4457 1215.5854 1230.7620 1234.5462 1241.6122 1254.4149 1260.7075 1275.6513 1297.0934 1306.3066 1306.6368 1319.5270 1332.2731 1344.3610 1353.2857 1354.1596 1362.3666 1377.8884 1385.6886 1391.4722 1422.0770 1429.7835 1436.5761 1438.8812 1441.3954 1444.5946 1451.5022 1465.9010 1469.2837 1473.0925 1493.9447 1500.3270 1509.6688 1517.3292 1527.7906 1548.8384 1565.1884 1577.1393 1585.1316 1613.5221 1628.7912 1630.0205 1634.0867 2947.4035 2955.2548 2978.4081 2980.9805 3041.3804 3054.7128 3056.4524 3075.2773 3082.7464 3113.4192 3114.2310 3122.9883 3133.0228 3140.2324 3144.0115 3144.6377 3145.7279 3146.9499 3148.7689 3161.7602 3162.0146 3166.0215 3168.4039 3170.7111 3176.9161 3409.0218
redmass: 7.8362 7.2210 6.6167 6.0952 9.9771 5.5062 7.5766 5.1215 5.7126 5.3413 5.6185 5.5345 4.3020 4.0635 3.8817 5.3389 4.3757 4.1927 3.5931 5.7227 4.1787 3.4814 4.7109 4.1898 1.3817 5.0585 4.5786 4.7426 4.5929 3.7571 3.2701 5.3671 4.0843 7.0035 3.1496 3.3064 4.4423 3.5817 4.0110 3.4107 4.0097 2.8880 2.6100 2.5660 2.9160 5.0855 2.8511 4.2286 1.4041 4.5231 4.2786 4.4853 6.8528 6.4782 5.6934 5.1578 4.0992 3.9663 2.2317 3.5199 3.0190 2.4480 3.7706 1.3487 1.3533 4.3943 1.5596 1.5515 1.5623 1.8760 2.3545 1.8173 2.6136 4.8292 1.4427 1.8350 1.3758 1.3370 1.9619 1.5878 1.3539 1.3167 1.3515 7.9055 2.9626 2.6160 1.8568 6.6177 2.6743 1.8345 2.1719 3.4618 1.2894 1.3242 1.5804 2.0836 1.3345 1.1603 1.3402 1.2159 1.8605 1.1277 1.1503 2.1343 2.2981 1.4159 2.8162 1.5978 1.4739 1.8366 1.2510 1.3924 1.1947 1.7529 1.5934 1.9443 1.3771 1.5561 3.8314 4.2300 4.3317 1.9048 3.8416 2.7875 1.1779 1.4113 1.2720 1.5534 2.6213 1.0504 1.1744 1.0862 1.1843 2.3144 2.0099 3.1830 2.7670 6.8532 6.3619 6.9359 5.2357 3.4356 6.3436 6.2089 2.6233 1.0863 1.0331 1.0683 1.0689 1.1038 1.0581 1.0580 1.0935 1.0927 1.0872 1.0891 1.0990 1.0882 1.0892 1.1097 1.1029 1.0875 1.0946 1.0815 1.0928 1.0947 1.0961 1.0955 1.0965 1.0962 1.0747
irintensity: 0.2904 0.3284 0.4535 2.0477 1.1649 2.2062 0.5348 2.2098 1.3233 2.2967 2.0364 2.1778 6.3761 9.7661 3.6803 1.0602 6.3886 3.6137 1.0395 4.3686 1.4032 19.2311 2.1758 1.9625 1.5906 1.3117 3.7796 12.3493 3.7095 11.7890 7.3195 4.5299 3.5513 0.7770 1.6543 1.1322 4.2202 6.3526 1.3629 12.1433 6.0235 8.1552 16.0278 20.2324 24.5277 35.1417 2.7561 4.5513 90.8126 11.8511 23.9102 24.6055 2.3246 6.0755 24.4407 7.2659 3.5871 4.6036 25.2695 8.5664 37.7928 28.5387 31.2173 18.8613 4.3062 3.8219 18.5649 46.0460 19.6870 67.7988 27.7897 0.9834 45.9253 76.7063 24.4604 90.8900 1.6606 1.6767 5.6372 21.1585 0.3176 3.3901 3.0092 47.3344 0.1986 24.4416 4.8687 26.7341 31.1297 6.0878 17.7339 110.3231 7.2160 16.0056 1.3425 131.5611 0.4168 14.3106 27.5279 34.0569 42.9386 86.3778 218.9651 540.0278 79.5165 186.3258 382.8661 64.3937 5.9129 346.6370 1.5697 17.6015 21.6906 14.6022 17.3069 58.2856 2.7558 355.8932 5.0556 21.0197 3.3976 61.0619 11.1081 13.8390 24.7185 19.4705 1.8683 18.4586 7.2657 13.9012 30.9119 124.9528 42.3372 361.9147 916.6911 442.9626 36.6758 18.7492 123.4421 125.1109 35.3587 265.7903 106.2004 408.9776 74.3358 73.0797 94.9653 40.8923 34.6885 51.1286 24.1444 13.7829 1.8876 7.7939 20.8567 16.8978 35.0923 23.4271 8.0940 22.2649 48.2210 39.2828 0.5515 466.0556 26.4642 26.7002 4.6054 21.0605 6.2193 18.1351 16.9490
temp: 298.150 k
press: 1.00000 atm
elementType: 17 17 8 8 7 7 7 7 6 6 6 6 6 6 6 6 6 6 6 6 6 6 6 6 6 6 6 6 6 6 6 6 6 1 1 1 1 1 1 1 1 1 1 1 1 1 1 1 1 1 1 1 1 1 1 1 1 1 1
symmnumber: 1
zpe: 1215421.5 jmol-1
zpe.correction: 0.462930 hartree
zpe.thermalcorrener: 0.494537 hartree
zpe.thermalcorrenthalpy: 0.495481 hartree
zpe.thermalcorrgfe: 0.393166 hartree
zpe.sumelectzpe: -2255.426829 hartree
zpe.sumelectthermal: -2255.395222 hartree
zpe.sumelectthermalent: -2255.394277 hartree
zpe.sumelectthermalfe: -2255.496592 hartree
dipole: 0.2127 3.6270 0.5109
dipole: 3.6690
quadrupole: -163.8468 -182.6621 -223.6362
quadrupole: 5.9116 -13.3575 -4.3137
quadrupole: 26.2015 7.3863 -33.5878 5.9116 -13.3575 -4.3137
hfenergy: -2255.8897583 hartree
pointgroup: C01 [X(C25H26Cl2N4O2)]
dipole: 0.1282855 -1.4346651 0.0947643 debye
polarizability: 755.1207813|0.7561681|381.6713572|20.1431139|-16.5078509|189.8465461 unknown
InChI: InChI=1S/C25H26Cl2N4O2/c1-33-22-12-8-20(9-13-22)29-24-5-3-2-4-23(24)25(32)30-28-18-19-6-10-21(11-7-19)31(16-14-26)17-15-27/h2-13,18,29-30H,14-17H2,1H3
charge 0 multiplicity 1
59 atoms
Cl 8.759927 1.497451 -2.939462
Cl 9.13927 1.942999 2.490163
O  -8.64359 3.338952 -0.27857
O  -1.513885 0.129302 -0.231064
N  7.238957 0.898885 -0.045077
N  -4.11102 -0.055301 -0.002974
N  -0.198591 -1.735796 0.240292
N  0.975534 -1.015903 0.101916
C  7.375476 2.257367 -0.592347
C  8.46693 0.201635 0.364317
C  5.980938 0.284183 0.075647
C  4.774595 0.969743 -0.295181
C  5.843777 -1.051883 0.572287
C  7.273127 2.341287 -2.122082
C  8.721613 0.19898 1.878772
C  3.391718 -0.976484 0.307708
C  3.521393 0.357138 -0.17763
C  4.581703 -1.659518 0.676399
C  -3.964757 -1.428942 0.128314
C  -2.635506 -2.014541 0.083411
C  2.094503 -1.63609 0.429653
C  -5.304815 0.715115 -0.075974
C  -5.080432 -2.299774 0.353955
C  -2.518053 -3.434771 0.134646
C  -1.440111 -1.128011 0.001689
C  -6.455762 0.31443 -0.801333
C  -5.306485 1.999114 0.540877
C  -4.913986 -3.687437 0.443513
C  -3.629258 -4.275433 0.301484
C  -7.589594 1.153212 -0.886779
C  -6.422831 2.845468 0.44643
C  -7.57734 2.422663 -0.259222
C  -9.848313 2.950734 -1.012914
H  8.342593 2.671213 -0.263119
H  6.600431 2.923247 -0.161378
H  9.32373 0.663382 -0.153163
H  8.440076 -0.852648 0.020847
H  4.811772 1.994005 -0.676575
H  6.721062 -1.629328 0.876446
H  7.304606 3.384931 -2.472123
H  6.392953 1.818373 -2.521907
H  9.59693 -0.415686 2.141255
H  7.838372 -0.103246 2.459117
H  2.612294 0.896846 -0.462634
H  4.519017 -2.687415 1.056696
H  2.102529 -2.680515 0.809219
H  -3.196615 0.437466 -0.106074
H  -6.075004 -1.865886 0.480871
H  -1.536411 -3.907748 0.007343
H  -6.457842 -0.63802 -1.339757
H  -4.421872 2.322647 1.100419
H  -5.790044 -4.322236 0.619114
H  -3.505907 -5.362358 0.325348
H  -0.171962 -2.705922 0.582558
H  -8.458151 0.812645 -1.458542
H  -6.427538 3.83236 0.918793
H  -10.303508 2.034562 -0.587442
H  -9.632159 2.790999 -2.087613
H  -10.54198 3.796456 -0.896756
