program: Gaussian 09
title: 000280279
version: EM64L-G09RevD.01
frameworkgroup: C1[X(C18H21NO4)]
method: RPBEPBE
basis: SDD
operation: Freq
keyword: #p
keyword: freq=noraman
keyword: PBEPBE/SDD
title: #p freq=noraman PBEPBE/SDD
converged: YES YES NO NO
title: Mulliken charges:
elementType: O O O O N C C C C C C C C C C C C C C C C C C H H H H H H H H H H H H H H H H H H H H H
charge: -0.303371 -0.300173 -0.292486 -0.452576 -0.310974 -0.320548 0.298127 -0.494373 0.291991 -0.543437 0.581928 -0.545800 -0.535676 0.211119 -0.514421 0.182543 -0.488929 0.220472 -0.363261 0.155541 -0.530924 -0.530704 -0.522556 0.252887 0.231479 0.207527 0.200615 0.233541 0.270542 0.273578 0.251507 0.273790 0.237634 0.212713 0.221731 0.251791 0.226294 0.254419 0.226397 0.221003 0.359074 0.209628 0.264005 0.228333
chargesum: 0.00000
title: Mulliken charges with hydrogens summed into heavy atoms:
elementType: O O O O N C C C C C C C C C C C C C C C C C C
charge: -0.303371 -0.300173 -0.292486 -0.093502 -0.040431 -0.067662 0.298127 -0.055367 0.291991 -0.109281 0.581928 -0.272222 -0.284169 0.211119 -0.240631 0.182543 -0.251296 0.220472 -0.150548 0.155541 0.168892 0.171116 0.179410
polarizability: 2.68480670e+02 8.48486081e+00 2.26048800e+02 1.87793980e+01 -4.58279228e+00 1.65470576e+02
1716.lowfreq: -5.6309 0.0005 0.0007 0.0008 5.6435 6.4579 25.9245 30.5035 33.8977
frequency: 25.7756 30.0225 33.8707 62.1931 76.2302 86.5332 103.6323 108.8024 125.2093 141.2588 153.1815 158.1981 165.6075 184.9539 219.9882 228.0848 248.6261 267.6988 273.3357 282.5602 300.1801 320.5302 327.4138 341.6035 370.4736 382.0872 411.0686 425.5674 435.2986 463.9087 470.0345 495.2671 542.7217 556.4064 580.0069 599.9838 645.0760 651.1020 672.0881 699.5699 717.7925 726.4288 735.9566 746.1477 783.6549 796.0211 818.1180 882.0595 890.9657 898.4035 907.5489 918.4011 922.4220 944.0904 962.8448 984.1069 998.8785 1008.7518 1048.0286 1079.3176 1092.0569 1113.7645 1114.4144 1115.2023 1142.4628 1143.1166 1152.0787 1155.8457 1159.2278 1162.9293 1176.0019 1188.5013 1190.7490 1218.6275 1228.6259 1242.6971 1253.0973 1266.6981 1273.2197 1275.3833 1306.5669 1316.5869 1361.1602 1369.0626 1390.9478 1395.0683 1412.3901 1422.7627 1439.2077 1441.7313 1446.1923 1456.2997 1456.4831 1458.2879 1462.8220 1472.9739 1477.9146 1481.9141 1487.3244 1490.3238 1499.6232 1566.4426 1595.2790 1615.3344 1619.2157 2825.7176 2866.3534 2967.1406 2970.2609 2974.5817 2977.0084 3013.2966 3048.4888 3062.4626 3066.9540 3084.7320 3103.3646 3116.2801 3118.0304 3127.8938 3134.3298 3139.0479 3149.1076 3149.9827 3472.8805 3580.1632
redmass: 4.5096 4.5082 4.4158 2.8235 2.7121 3.3801 3.0147 3.4031 2.8882 2.0161 1.6385 1.0954 1.4506 3.2263 3.8898 3.4314 5.1675 5.3333 4.1206 4.3715 2.3880 1.2469 4.4689 3.9927 5.3231 4.7343 3.7159 4.3626 4.9979 2.8077 2.9706 3.9234 3.8675 5.9498 3.2060 3.4626 4.5493 4.9098 4.5828 4.2139 5.8338 3.7240 3.5675 3.1622 3.0808 1.7181 4.2974 1.5231 2.3057 2.5225 1.8350 3.0892 1.3576 3.9095 3.2213 1.9986 3.3857 3.0061 2.6330 2.3917 3.7852 1.2412 1.2398 1.2458 2.1157 1.6691 1.4488 1.4867 1.5966 1.2833 1.8614 1.1848 3.1444 1.4534 1.4494 1.5766 1.2886 2.4101 1.4523 3.7243 1.6797 1.4543 2.4419 5.1223 6.4723 2.0662 2.1118 1.1714 1.2902 1.3941 1.3876 1.0619 1.0550 1.0712 1.1056 1.1270 1.0571 1.0576 1.0632 2.9565 3.0443 8.7560 6.5448 6.9491 7.2279 1.0713 1.0703 1.0307 1.0312 1.0355 1.0822 1.0862 1.0904 1.1042 1.1033 1.0961 1.0883 1.1025 1.1028 1.1048 1.0913 1.0948 1.0915 1.0917 1.0755 1.0660
irintensity: 0.7136 0.3442 0.6474 8.3771 1.3573 3.7281 5.8077 3.5531 2.3470 2.2768 1.2015 0.0609 1.6780 1.3704 1.4587 5.6748 4.8217 2.4260 7.6744 15.4429 3.2812 113.3804 6.1338 10.8069 2.0120 1.3168 19.7593 5.2303 2.5330 38.9919 5.0324 4.3025 21.7695 31.5287 64.4385 40.0472 12.5554 8.8343 15.7727 19.0406 23.2824 2.6847 2.7431 7.0797 11.5101 36.5059 7.6297 11.1282 33.1810 20.5404 5.8587 27.4934 0.3988 39.8762 43.0525 8.7728 45.3871 11.6230 14.2212 135.4552 69.2063 14.0029 6.2590 1.7206 15.7166 13.6043 5.7297 14.8743 12.4988 51.9959 36.3166 4.4002 61.6999 38.5805 8.8395 5.9863 28.4602 158.4401 46.7378 115.2926 11.8268 22.9719 12.3971 1.4780 2.0387 15.9479 18.3400 0.2077 3.5662 9.2582 8.4090 7.6580 20.7199 11.4461 6.2201 20.6361 6.7338 28.8357 8.5015 156.8603 118.8370 0.8858 29.9616 2.8021 1.6264 93.1210 89.6624 75.0697 71.1124 85.1104 16.5186 35.3294 36.7218 30.8646 24.7944 39.8205 22.5873 25.9481 27.4430 14.6648 9.7389 14.8954 3.0666 0.7048 0.7709 39.3669
temp: 298.150 k
press: 1.00000 atm
elementType: 8 8 8 8 7 6 6 6 6 6 6 6 6 6 6 6 6 6 6 6 6 6 6 1 1 1 1 1 1 1 1 1 1 1 1 1 1 1 1 1 1 1 1 1
symmnumber: 1
zpe: 930041.4 jmol-1
zpe.correction: 0.354234 hartree
zpe.thermalcorrener: 0.376991 hartree
zpe.thermalcorrenthalpy: 0.377935 hartree
zpe.thermalcorrgfe: 0.301600 hartree
zpe.sumelectzpe: -1052.389471 hartree
zpe.sumelectthermal: -1052.366714 hartree
zpe.sumelectthermalent: -1052.365770 hartree
zpe.sumelectthermalfe: -1052.442105 hartree
dipole: -1.0901 -0.1088 -1.2305
dipole: 1.6475
quadrupole: -118.1600 -118.2116 -135.4967
quadrupole: 1.7038 11.6271 1.6322
quadrupole: 5.7961 5.7445 -11.5406 1.7038 11.6271 1.6322
hfenergy: -1052.7437054 hartree
pointgroup: C01 [X(C18H21N1O4)]
dipole: 0.4274022 -0.0859705 0.4796671 debye
polarizability: 268.0171929|-10.7746844|225.6484297|18.2648712|8.2095791|166.3344237 unknown
InChI: InChI=1S/C18H21NO4/c1-21-16-6-11(4-5-15(16)20)14-10-19-9-12-7-17(22-2)18(23-3)8-13(12)14/h4-8,14,19-20H,9-10H2,1-3H3
charge 0 multiplicity 1
44 atoms
O  -2.495727 -2.410982 0.794007
O  -4.640081 -1.011508 -0.637588
O  3.371998 -1.238329 -1.877491
O  5.260929 -1.27871 0.311979
N  -0.768994 3.760953 -0.155956
C  0.313953 1.706605 0.681575
C  -0.979456 0.975111 0.29108
C  0.485391 2.988479 -0.183184
C  -2.018871 1.644761 -0.413143
C  -1.864458 3.089285 -0.878138
C  1.581294 0.856697 0.618833
C  -1.175578 -0.375845 0.673026
C  -3.220953 0.955891 -0.700426
C  -2.364524 -1.063728 0.370302
C  1.916279 0.11801 -0.543245
C  -3.416317 -0.380045 -0.304578
C  2.48919 0.84278 1.704365
C  3.120739 -0.610583 -0.645407
C  3.701598 0.124317 1.620055
C  4.034853 -0.590609 0.448893
C  -2.623974 -3.384572 -0.314873
C  -5.442765 -1.446515 0.529227
C  3.861093 -2.632949 -1.860963
H  0.188284 2.055522 1.726922
H  1.301658 3.603554 0.234997
H  0.788237 2.685739 -1.216969
H  -1.705699 3.079525 -1.988724
H  -2.806158 3.6402 -0.694776
H  -0.649606 4.741386 -0.43493
H  -0.385773 -0.923295 1.197883
H  -4.042406 1.457091 -1.225698
H  1.234119 0.078401 -1.399149
H  2.250731 1.396151 2.619949
H  4.401548 0.128275 2.467016
H  -1.69862 -3.392845 -0.922127
H  -3.490157 -3.140781 -0.956729
H  -2.764074 -4.364104 0.167813
H  -4.8647 -2.133969 1.172689
H  -6.321588 -1.957491 0.106714
H  -5.765803 -0.566072 1.117092
H  5.817321 -1.145222 1.119006
H  3.136758 -3.288817 -1.339678
H  4.847399 -2.70316 -1.375398
H  3.9265 -2.918605 -2.921951
