program: Gaussian 09
title: 000278701
version: EM64L-G09RevD.01
frameworkgroup: C1[X(C12H8BrNO2)]
method: RPBEPBE
basis: SDD
operation: Freq
keyword: #p
keyword: freq=noraman
keyword: PBEPBE/SDD
title: #p freq=noraman PBEPBE/SDD
converged: YES YES NO NO
title: Mulliken charges:
elementType: Br O O N C C C C C C C C C C C C H H H H H H H H
charge: 0.083613 -0.203409 -0.178149 0.010588 0.388961 0.333122 -0.340696 -0.385365 0.504947 -0.391519 -0.358224 -0.381269 -0.378109 -0.232406 -0.232843 -0.232163 0.267957 0.254124 0.285226 0.240024 0.242183 0.233007 0.233536 0.236864
chargesum: 0.00000
title: Mulliken charges with hydrogens summed into heavy atoms:
elementType: Br O O N C C C C C C C C C C C C
charge: 0.083613 -0.203409 -0.178149 0.010588 0.388961 0.333122 -0.072739 -0.131241 0.504947 -0.391519 -0.072998 -0.141245 -0.135926 0.000600 0.000693 0.004702
polarizability: 2.88405599e+02 -7.26676501e+00 1.72481486e+02 -4.97925660e+00 -1.32916913e+01 7.04827220e+01
1716.lowfreq: -7.6376 -5.1730 -0.0005 0.0003 0.0004 4.3656 42.6991 46.5170 54.9477
frequency: 42.6745 46.4458 54.9402 82.3896 129.0630 158.9882 184.9081 219.3591 245.4743 276.1731 325.5823 388.4446 403.3001 442.7969 466.6685 500.2889 528.8877 592.5186 614.8978 630.9449 662.2550 672.7032 700.3758 729.3821 739.4249 772.4460 814.0014 847.5728 850.0335 890.1268 926.8933 975.1104 976.5773 989.3098 999.9299 1004.8833 1018.7844 1044.1865 1088.5733 1120.5110 1159.7950 1176.9631 1197.1861 1208.7686 1261.4851 1294.1794 1313.3299 1349.1866 1373.7385 1381.1147 1397.4681 1439.0515 1453.1518 1496.1537 1550.7590 1586.2506 1597.0479 1612.0822 3128.9690 3132.0918 3144.1809 3154.0236 3157.3593 3166.6256 3170.1717 3181.8218
redmass: 6.0569 7.6628 6.7079 6.6754 4.6242 17.9616 6.1750 6.8668 9.0754 9.4748 6.6111 4.7911 2.8243 3.6085 6.7186 4.1456 6.6992 4.6171 6.4921 7.4596 7.4908 4.3128 1.7609 4.0470 9.0348 1.8634 8.0035 1.4668 1.2536 1.4624 1.4479 1.3822 1.4584 4.7740 1.3261 7.0488 3.6283 2.0572 1.6205 2.3775 1.5397 1.0548 1.2601 5.4859 1.4451 2.4299 1.5327 2.5725 8.1772 9.5025 5.4761 2.4072 2.3107 2.6940 7.0584 6.1433 6.3807 6.0366 1.0852 1.0877 1.0920 1.0958 1.0898 1.0919 1.1014 1.0959
irintensity: 0.6439 0.3112 0.8299 0.3559 3.0890 0.8214 0.9497 0.0092 0.0759 1.7478 2.1479 0.7281 0.9942 7.8090 5.2122 8.3297 1.4159 3.3322 0.3759 0.0489 13.1517 10.1272 47.1496 17.3252 26.7252 65.8546 28.4507 27.0162 1.9248 12.5359 0.8209 2.6602 1.5551 1.9695 0.0093 26.1743 16.5041 5.1542 7.7261 5.8582 9.1377 0.0726 77.7433 363.2070 3.3934 5.4837 2.5671 10.5596 37.8691 50.2639 61.2560 1.4042 42.6708 4.2419 49.9942 0.7384 182.6632 0.1575 5.3983 0.2537 11.1602 21.8039 11.6711 0.3856 26.1711 2.4492
temp: 298.150 k
press: 1.00000 atm
elementType: 35 8 8 7 6 6 6 6 6 6 6 6 6 6 6 6 1 1 1 1 1 1 1 1
symmnumber: 1
zpe: 444058.5 jmol-1
zpe.correction: 0.169133 hartree
zpe.thermalcorrener: 0.182481 hartree
zpe.thermalcorrenthalpy: 0.183425 hartree
zpe.thermalcorrgfe: 0.126765 hartree
zpe.sumelectzpe: -679.540747 hartree
zpe.sumelectthermal: -679.527399 hartree
zpe.sumelectthermalent: -679.526455 hartree
zpe.sumelectthermalfe: -679.583115 hartree
dipole: 6.9635 -0.6552 -0.0897
dipole: 6.9948
quadrupole: -105.6249 -95.0368 -103.9597
quadrupole: 7.2240 0.7243 -1.4416
quadrupole: -4.0844 6.5037 -2.4193 7.2240 0.7243 -1.4416
hfenergy: -679.7098799 hartree
pointgroup: C01 [X(C12H8Br1N1O2)]
dipole: -2.7456464 0.1305488 0.133076 debye
dipolederiv: -0.1223503 0.2167397 0.0702277 0.2994675 -0.4063821 -0.1833069 0.0829707 -0.1597722 -0.0367692 -0.7407665 -0.2086879 -0.1556611 -0.297293 -0.4370283 -0.2618002 -0.2069726 -0.2334857 -0.5406301 -0.8224209 0.0048858 0.1652455 0.140609 -0.2707901 -0.1627375 0.2161335 -0.1576006 -0.4850884 2.0383564 0.3664208 0.0375763 0.2005498 0.4559977 0.4812167 0.0044125 0.3973557 0.8442032 0.9612189 0.0339333 0.0038446 -0.0413441 0.2027819 0.0491302 -0.0361027 0.0663593 0.054202 -0.1639366 -0.0190566 -0.0057592 0.0003717 -0.0263488 0.007487 0.0222126 -0.0234262 -0.0134603 -0.6866752 0.2750751 0.1123832 0.4007938 -0.2105425 -0.0683159 0.2096248 -0.054296 -0.1174765 -0.483516 -0.1761037 -0.063706 -0.2574208 -0.0573936 0.0304463 -0.1484104 0.0364063 -0.1305382 -1.0570874 -0.0289877 0.019359 -0.0372925 -0.1362714 -0.13333 -0.0034802 -0.0936442 -0.0120718 0.6849118 -0.5237838 -0.2168207 -0.2975016 0.791368 0.3436535 0.0478172 0.3602838 0.0297486 0.3788928 0.0470732 0.0240583 -0.0927219 -0.0572219 0.0191106 -0.2098552 -0.0071534 -0.0846328 -0.0186997 0.0451683 0.0718795 -0.1413731 -0.1063732 0.0769145 -0.028275 0.0701967 -0.0057906 -0.0211671 -0.0186879 -0.073305 0.1459127 -0.1072484 0.0647622 0.0113427 0.0605526 -0.0112863 -0.0973604 -0.0539867 -0.0959695 -0.0904736 -0.0830555 0.0963828 -0.1953547 0.0974425 0.0248518 -0.1174141 0.0557977 0.0862753 0.0875991 -0.0720819 0.1059561 0.1879148 0.108975 0.0264209 0.0683969 0.014913 0.0014099 0.0085132 -0.1170935 0.046217 -0.001999 0.0511288 -0.0744559 0.0753622 -0.0587902 -0.0222685 -0.0693786 0.0264531 -0.0406314 -0.0319731 -0.0461288 0.1212635 0.0427384 0.08045 0.0360039 0.0838521 0.0176561 -0.0501741 0.0376501 -0.0550504 0.1212918 0.0733242 -0.0298105 -0.0137845 -0.023065 0.0651827 -0.0347773 0.024384 -0.0522625 0.1444789 0.0682791 -0.0562955 -0.0847029 -0.0391355 0.0925025 -0.085459 -0.0809369 -0.0713546 0.0164791 0.0546779 0.0440227 0.0894003 0.0394052 0.0978666 -0.0765333 0.0897095 -0.0691556 0.0175758 0.0010056 0.0406261 0.0724216 0.06274 0.1022373 -0.0929677 0.0961164 -0.0952158 -0.000304 0.0155958 -0.0402945 -0.0588938 -0.0698761 0.0945752 -0.0988229 -0.086087 -0.1008617 -0.0009013 -0.1313655 -0.0106209 0.0007859 -0.0129381 0.1412102 -0.0324206 -0.000842 -0.029293 0.1128899 unknown
polarizability: 287.7328134|-7.6797502|135.169511|-9.0139736|51.465419|108.4674831 unknown
InChI: InChI=1S/C12H8BrNO2/c13-11-8-10(6-7-12(11)14(15)16)9-4-2-1-3-5-9/h1-8H
charge 0 multiplicity 1
24 atoms
Br 2.603133 -2.459496 -1.166398
O  4.289055 1.214706 0.968524
O  4.51676 -0.117567 -0.869682
N  3.805921 0.4540 0.038842
C  -0.512085 0.142351 0.016861
C  -1.998504 0.06526 0.001841
C  0.272694 -0.927002 -0.493787
C  0.166177 1.275351 0.548534
C  2.33507 0.27158 0.017617
C  1.680787 -0.872614 -0.50873
C  1.566204 1.332455 0.556818
C  -2.768878 0.689025 1.022553
C  -2.683497 -0.630469 -1.032975
C  -4.177299 0.616049 1.010627
C  -4.091921 -0.700558 -1.046652
C  -4.845842 -0.078642 -0.02428
H  -0.21939 -1.834704 -0.853761
H  -0.406252 2.12708 0.927527
H  2.100031 2.195253 0.964293
H  -2.2643 1.202994 1.848321
H  -2.114755 -1.088673 -1.850005
H  -4.752443 1.092657 1.811817
H  -4.601255 -1.231854 -1.85787
H  -5.93971 -0.13428 -0.034038
