program: Gaussian 09
title: 000278682
version: EM64L-G09RevD.01
frameworkgroup: C1[X(C10H14N6O2)]
method: RPBEPBE
basis: SDD
operation: Freq
keyword: #p
keyword: freq=noraman
keyword: PBEPBE/SDD
title: #p freq=noraman PBEPBE/SDD
converged: YES YES NO NO
title: Mulliken charges:
elementType: O O N N N N N N C C C C C C C C C C H H H H H H H H H H H H H H
charge: -0.442133 -0.425703 -0.211731 -0.071290 -0.091611 -0.025179 -0.067409 -0.602928 -0.108608 -0.051750 -0.532766 -0.116879 -0.477529 -0.420907 0.140596 -0.144824 0.212742 -0.341225 0.288682 0.232227 0.234157 0.244037 0.251805 0.241914 0.250235 0.200345 0.219037 0.344445 0.331891 0.249374 0.340567 0.350418
chargesum: 0.00000
title: Mulliken charges with hydrogens summed into heavy atoms:
elementType: O O N N N N N N C C C C C C C C C C
charge: -0.097688 -0.093813 -0.211731 -0.071290 -0.091611 -0.025179 -0.067409 0.088057 0.180073 0.180477 -0.054572 0.134926 0.014620 -0.001526 0.140596 -0.144824 0.212742 -0.091850
polarizability: 2.26410549e+02 4.81599824e+00 1.37850526e+02 2.73537968e+00 -1.81977101e+01 1.08949635e+02
1716.lowfreq: -41.0469 -12.8246 -6.1950 -0.0001 0.0004 0.0006 5.0729 15.0527 38.8633
frequency: -41.0132 14.7401 38.7959 54.9709 100.4049 125.2640 150.7919 193.6539 202.3930 211.2617 259.2992 270.8112 299.7305 311.7502 322.9636 361.6165 405.6412 430.9732 459.4782 503.4298 514.6055 536.6670 554.7326 557.9603 559.6617 598.1019 626.7389 658.3143 674.8633 695.6567 749.9785 804.3145 818.5991 849.1432 865.2211 894.2036 932.9646 939.9974 952.4196 961.1752 969.7407 978.6342 1017.5367 1044.3718 1050.2259 1077.0273 1088.9411 1112.8754 1139.2598 1158.7700 1175.0354 1188.3833 1217.9663 1235.2735 1240.3925 1253.1904 1270.8477 1278.4128 1287.0308 1295.7801 1304.3956 1323.0594 1327.9194 1353.6953 1357.8930 1373.5220 1378.0558 1381.1178 1424.9223 1446.7740 1463.6839 1468.6596 1479.3136 1540.5698 1576.1622 1634.6929 2948.2369 2960.9227 2988.1054 3000.7341 3028.5174 3030.2455 3060.6553 3076.2436 3093.2707 3169.3567 3533.9570 3557.2870 3558.5887 3688.1085
redmass: 2.6816 6.1334 5.8148 4.0065 3.9556 5.4427 5.1072 7.4468 2.7635 5.8567 5.3965 3.5596 1.1908 1.4008 2.9402 4.6188 2.8809 2.7036 2.6677 8.9845 3.8701 1.1470 3.5315 1.2520 3.8804 3.4215 8.1452 7.9164 10.4421 8.5581 3.8754 11.6658 2.6860 2.7962 7.6671 1.4945 4.0012 1.4423 2.7896 2.3340 2.7515 2.3816 2.3946 4.1573 2.3391 2.7937 2.2687 2.1213 1.8027 2.3349 2.7152 4.8603 1.3306 1.2764 3.4027 1.2936 1.5713 1.2039 3.5859 1.2941 1.4379 5.3793 1.3509 1.4748 1.5896 1.2961 1.4555 1.4393 6.2695 3.3662 1.0785 1.0875 1.0952 8.6847 2.0401 2.3648 1.0692 1.0823 1.0853 1.0621 1.0726 1.0747 1.0967 1.1029 1.1024 1.0923 1.0447 1.0661 1.0661 1.1056
irintensity: 1.9504 0.1889 0.2508 2.6466 3.1447 6.3582 4.7339 0.2070 3.3487 1.6154 2.7379 20.7727 148.7814 107.7989 44.8422 12.4784 32.1209 11.4633 9.8829 2.2390 7.1642 190.5982 7.9399 83.5243 1.4254 1.4061 1.8534 23.9001 9.0700 13.1834 4.7984 6.8716 3.1462 2.3474 10.3484 6.5984 48.2778 10.7098 84.7259 15.1609 13.7948 16.0703 68.0867 34.5268 12.9967 4.5276 11.7831 5.9394 30.4076 5.3874 8.5107 4.1964 42.2983 18.0950 37.6815 7.3635 2.6842 1.3126 38.3414 2.0601 18.8397 124.7307 2.2659 19.7403 16.6017 11.6447 13.2038 8.5301 19.5629 21.9870 10.1184 4.8404 8.3113 119.0120 52.1724 579.5729 63.2264 29.9371 14.9963 19.4275 20.0819 4.6305 19.9314 24.8945 18.4778 14.0950 148.1215 8.4907 5.5664 53.3469
temp: 298.150 k
press: 1.00000 atm
elementType: 8 8 7 7 7 7 7 7 6 6 6 6 6 6 6 6 6 6 1 1 1 1 1 1 1 1 1 1 1 1 1 1
symmnumber: 1
zpe: 658374.7 jmol-1
zpe.correction: 0.250762 hartree
zpe.thermalcorrener: 0.266283 hartree
zpe.thermalcorrenthalpy: 0.267227 hartree
zpe.thermalcorrgfe: 0.206508 hartree
zpe.sumelectzpe: -867.038753 hartree
zpe.sumelectthermal: -867.023232 hartree
zpe.sumelectthermalent: -867.022288 hartree
zpe.sumelectthermalfe: -867.083006 hartree
dipole: -2.6996 -0.5792 -1.4045
dipole: 3.0977
quadrupole: -100.5443 -111.4241 -104.3224
quadrupole: 11.4721 -13.2972 -0.5059
quadrupole: 4.8860 -5.9938 1.1078 11.4721 -13.2972 -0.5059
hfenergy: -867.2895149 hartree
pointgroup: C01 [X(C10H14N6O2)]
dipole: 1.0699789 -0.1739322 0.5569739 debye
polarizability: 226.4941671|-4.1310708|140.8913445|1.5352169|15.3361695|105.8251978 unknown
InChI: InChI=1S/C10H14N6O2/c11-9-8-10(13-4-12-9)16(15-14-8)6-1-5(3-17)2-7(6)18/h4-7,17-18H,1-3,11H2
charge 0 multiplicity 1
32 atoms
O  -1.617196 1.611417 -2.084884
O  -5.862693 -0.355035 0.744395
N  0.274119 -0.210421 -0.124401
N  0.46986 -1.515466 -0.667575
N  1.795424 -1.762758 -0.681389
N  1.768169 1.574387 0.749297
N  4.135326 0.891538 0.620889
N  4.833841 -1.196105 -0.227802
C  -1.075704 0.346607 0.030235
C  -3.400898 0.098971 0.656062
C  -1.986733 -0.453012 0.989124
C  -1.877683 0.395721 -1.307988
C  -3.366271 0.388445 -0.879652
C  -4.522682 -0.86204 1.080465
C  1.492413 0.350742 0.202634
C  2.446577 -0.641492 -0.155738
C  3.823682 -0.32887 0.074705
C  3.111103 1.754291 0.920877
H  -0.936624 1.382325 0.394366
H  -3.535802 1.058769 1.199185
H  -1.91976 -1.530304 0.742109
H  -1.702134 -0.323733 2.047558
H  -1.619455 -0.506204 -1.899146
H  -3.935709 -0.378637 -1.432123
H  -3.811726 1.364841 -1.130705
H  -4.447936 -1.0892 2.1666
H  -4.444714 -1.810775 0.520665
H  -0.703612 1.572756 -2.466639
H  -6.010984 0.499746 1.223045
H  3.415951 2.711511 1.354195
H  5.794459 -0.91448 -0.039155
H  4.626992 -2.107734 -0.63131
