program: Gaussian 09
title: 000278699
version: EM64L-G09RevD.01
frameworkgroup: C1[X(C15H13Cl2NO6S)]
method: RPBEPBE
basis: SDD
operation: Freq
keyword: #p
keyword: freq=noraman
keyword: PBEPBE/SDD
title: #p freq=noraman PBEPBE/SDD
converged: YES YES NO NO
title: Mulliken charges:
elementType: Cl Cl S O O O O O O N C C C C C C C C C C C C C C C H H H H H H H H H H H H H
charge: -0.006334 -0.211320 0.899462 -0.270744 -0.251152 -0.460983 -0.460765 -0.208385 -0.206198 0.021467 -0.450030 -0.303396 -0.295933 0.390909 0.513898 -0.137246 -0.311128 -0.349933 -0.203599 -0.182351 -0.299272 -0.288435 0.405079 -0.358055 -0.382552 0.231189 0.227404 0.231209 0.253229 0.233054 0.244130 0.270262 0.267891 0.287597 0.290197 0.266686 0.313479 0.290669
chargesum: 0.00000
title: Mulliken charges with hydrogens summed into heavy atoms:
elementType: Cl Cl S O O O O O O N C C C C C C C C C C C C C C C
charge: -0.006334 -0.211320 0.899462 -0.270744 -0.251152 -0.460983 -0.460765 -0.208385 -0.206198 0.021467 0.008562 0.181043 0.181251 0.390909 0.513898 -0.137246 -0.040866 -0.082042 0.083997 0.107846 -0.299272 -0.021749 0.405079 -0.044576 -0.091883
polarizability: 3.02343564e+02 1.04779796e+01 2.57396456e+02 2.22423382e+01 -3.05552182e+00 2.28829645e+02
1716.lowfreq: -14.3460 -1.9938 -0.0030 -0.0027 -0.0019 3.1899 7.7052 8.2488 13.6201
frequency: -11.0276 7.9562 13.4940 30.1255 44.6044 53.9648 65.2094 71.5657 81.3957 116.3132 128.7372 153.2504 158.9750 164.7819 170.4277 179.1678 192.7598 206.8755 230.5308 244.5640 267.3556 306.5536 317.6783 320.7979 333.3278 343.6498 386.5233 413.0530 414.2784 425.2855 445.6859 461.0321 480.0663 502.6292 517.0257 534.1164 550.0903 610.3654 626.7296 636.3648 686.0523 689.2992 708.1013 729.7423 736.4064 774.1199 812.8811 820.1119 824.0062 830.3914 839.5285 855.6900 899.1553 920.9540 937.6167 952.2724 957.1694 960.4030 973.0314 973.3313 978.5836 1030.6005 1043.2197 1045.7703 1082.3044 1103.4516 1119.4987 1126.4755 1142.9106 1176.9048 1205.2830 1209.4680 1210.1530 1234.9293 1247.4753 1261.4446 1290.8203 1294.5860 1356.7434 1361.7891 1377.8065 1381.5586 1391.9666 1398.6019 1418.1693 1418.7803 1440.1704 1460.2396 1464.8757 1479.7703 1482.4468 1579.1478 1580.0244 1594.5565 1602.4871 2985.5794 2987.0178 3016.8869 3053.9928 3060.8954 3081.2046 3160.8929 3162.4064 3169.9636 3181.1088 3183.3965 3187.1180 3190.6856
redmass: 15.1981 13.4865 14.0582 9.3576 4.3512 9.6985 11.8874 9.7539 9.6427 5.0268 8.6857 7.7413 5.0866 9.4244 5.3431 13.8151 5.0788 3.3084 8.5221 6.2672 5.8881 5.9390 4.7487 7.2193 8.1529 7.1063 7.5484 5.2935 3.0014 5.8263 3.3175 6.3616 8.4237 3.2537 3.0352 4.5969 5.2660 6.6684 6.3278 6.8027 5.5679 7.0236 3.3633 4.3109 3.8466 4.9396 1.3515 1.8788 8.4857 2.4832 1.6291 3.2612 3.3487 1.4157 2.9520 2.5740 1.6406 10.7710 1.3611 1.3618 4.9493 2.6706 2.2207 2.1324 1.8333 3.5601 1.2951 2.2885 1.2708 1.1995 1.1543 1.1585 5.0675 3.2768 2.6055 1.8581 1.1851 1.2248 6.4452 1.3186 2.1141 1.7308 2.3827 5.3008 5.3883 4.2271 1.0894 1.7215 1.7357 1.3397 1.4347 7.3494 7.6287 6.4675 7.4034 1.0559 1.0564 1.0632 1.1070 1.1075 1.1025 1.0896 1.0891 1.0885 1.0963 1.0968 1.0930 1.0964
irintensity: 0.2043 0.6682 0.4082 0.8965 0.5675 0.4089 0.1602 0.5210 1.9205 0.9642 0.8392 10.2978 0.8112 7.9771 0.1802 1.8206 5.4883 12.8618 0.8209 0.3549 2.0517 14.0710 1.3423 0.3029 0.8936 1.7165 34.5268 32.1571 0.0948 57.7114 4.1043 101.9872 1.8447 10.3786 52.6315 0.2543 1.6711 1.7497 20.5533 2.6457 16.1323 50.4122 8.3491 7.6366 4.6842 4.3094 11.5052 47.4056 65.1160 34.3993 74.0634 13.6448 5.8524 26.3548 125.4748 57.1889 17.1187 54.2941 4.7211 1.6406 1.1420 30.2260 84.8300 24.4322 4.0279 31.9246 13.3289 7.5996 64.9009 132.6069 32.9387 17.5429 508.8463 391.1897 215.6266 49.9692 11.0128 4.5754 40.2234 4.1588 8.8198 8.9564 20.2245 73.9322 26.0664 10.4446 20.1424 210.6915 68.9193 10.9268 4.7960 56.7971 27.4053 165.2582 126.6524 33.0255 12.2114 14.9684 18.1748 40.2187 21.9223 1.5648 1.8884 4.1688 0.0630 11.6670 7.2160 6.9262
temp: 298.150 k
press: 1.00000 atm
elementType: 17 17 16 8 8 8 8 8 8 7 6 6 6 6 6 6 6 6 6 6 6 6 6 6 6 1 1 1 1 1 1 1 1 1 1 1 1 1
symmnumber: 1
zpe: 682479.9 jmol-1
zpe.correction: 0.259943 hartree
zpe.thermalcorrener: 0.283680 hartree
zpe.thermalcorrenthalpy: 0.284624 hartree
zpe.thermalcorrgfe: 0.201954 hartree
zpe.sumelectzpe: -2401.586450 hartree
zpe.sumelectthermal: -2401.562713 hartree
zpe.sumelectthermalent: -2401.561769 hartree
zpe.sumelectthermalfe: -2401.644439 hartree
dipole: -2.9563 10.1527 -1.6398
dipole: 10.7007
quadrupole: -256.1685 -170.5331 -161.4319
quadrupole: -9.1228 0.7188 -3.6755
quadrupole: -60.1240 25.5114 34.6126 -9.1228 0.7188 -3.6755
hfenergy: -2401.8463931 hartree
pointgroup: C01 [X(C15H13Cl2N1O6S1)]
dipole: 1.1701442 -4.0145125 -0.4882732 debye
polarizability: 308.3252976|8.6900038|256.7925202|-7.1479002|5.6758946|223.4518475 unknown
InChI: InChI=1S/C15H13ClNO6S.Cl/c16-14-10-11(17(18)19)2-7-15(14)23-9-1-8-22-12-3-5-13(6-4-12)24(20)21;/h2-7,10H,1,8-9H2;
charge 0 multiplicity 1
38 atoms
Cl 2.250455 -0.429669 3.309002
Cl -5.296765 3.283603 -0.482977
S  -6.197896 1.087715 -0.997979
O  -1.177028 -2.231206 -0.88362
O  2.02153 -1.868561 0.749695
O  -7.16682 0.68077 0.233614
O  -6.735839 1.146114 -2.523618
O  6.668107 2.377361 -0.401611
O  6.158819 2.852336 1.77356
N  5.990767 2.181551 0.681976
C  0.585754 -3.636896 -0.024184
C  -0.697736 -2.896001 0.353456
C  1.716072 -2.695452 -0.44292
C  -2.340472 -1.472204 -0.824393
C  3.001214 -0.896092 0.657051
C  -4.643118 0.068131 -0.927643
C  -3.110037 -1.282865 0.355705
C  -2.738911 -0.879769 -2.054289
C  -4.275797 -0.493058 0.305715
C  -3.89845 -0.091593 -2.113114
C  3.236209 -0.112394 1.824785
C  3.774257 -0.637727 -0.506773
C  4.960826 1.12276 0.670249
C  4.206861 0.892926 1.845084
C  4.754268 0.370149 -0.504157
H  0.913001 -4.237032 0.844768
H  0.378326 -4.333854 -0.857074
H  -1.471416 -3.603126 0.710019
H  -0.497171 -2.134047 1.130134
H  2.619137 -3.264822 -0.735898
H  1.398491 -2.038007 -1.274311
H  -2.813995 -1.732791 1.306298
H  -2.127972 -1.050159 -2.944889
H  -4.888961 -0.334465 1.19816
H  -4.227137 0.367748 -3.050071
H  3.611174 -1.223565 -1.41473
H  4.391219 1.496619 2.737006
H  5.358135 0.582674 -1.389725
