program: Gaussian 09
title: 000278695
version: EM64L-G09RevD.01
frameworkgroup: C1[X(C15H13ClFN3O6S)]
method: RPBEPBE
basis: SDD
operation: Freq
keyword: #p
keyword: freq=noraman
keyword: PBEPBE/SDD
title: #p freq=noraman PBEPBE/SDD
converged: YES YES NO NO
title: Mulliken charges:
elementType: Cl S F O O O O O O N N N C C C C C C C C C C C C C C C H H H H H H H H H H H H H
charge: -0.014485 1.090131 -0.349093 -0.264812 -0.288160 -0.481031 -0.484896 -0.204501 -0.204127 -0.413524 -0.488322 0.022008 -0.397149 -0.273147 0.505421 -0.141373 0.507574 -0.424203 -0.307521 -0.188414 -0.205950 0.295523 -0.290933 -0.286759 0.406191 -0.357647 -0.378415 0.267338 0.248063 0.243281 0.228147 0.320569 0.237349 0.324253 0.304303 0.286734 0.284448 0.265756 0.314598 0.292776
chargesum: 0.00000
title: Mulliken charges with hydrogens summed into heavy atoms:
elementType: Cl S F O O O O O O N N N C C C C C C C C C C C C C C C
charge: -0.014485 1.090131 -0.349093 -0.264812 -0.288160 -0.481031 -0.484896 -0.204501 -0.204127 -0.092955 -0.184019 0.022008 0.118252 0.198281 0.505421 -0.141373 0.507574 -0.186854 0.016733 0.098320 0.078499 0.295523 -0.290933 -0.021003 0.406191 -0.043049 -0.085639
polarizability: 3.92965812e+02 -4.28703284e+00 2.20186806e+02 -7.15348292e+00 -3.25885843e+01 2.02279051e+02
1716.lowfreq: -2.2093 -0.4801 -0.0017 0.0006 0.0016 6.5774 8.4640 13.1113 17.2096
frequency: 6.7964 12.4867 17.1771 27.0466 37.4916 49.1859 62.6102 63.6670 74.6204 94.8482 106.2084 123.4220 139.5497 146.8697 166.4358 170.6094 176.6296 202.0103 215.4961 236.3963 266.3815 285.0693 293.0176 319.4707 329.4371 337.3391 352.2497 356.0426 382.6991 396.5672 411.9204 445.4557 451.1176 463.9075 482.3364 506.1496 530.7844 535.2089 550.9073 554.6932 612.6320 629.2447 634.2098 644.9796 685.3363 687.8163 705.5012 712.4794 717.6383 728.3116 751.7747 818.9959 824.8512 825.8522 834.9040 851.8882 858.9888 883.5772 919.7748 922.4966 956.7146 974.6628 980.8904 990.3162 993.6399 997.5743 1023.0807 1031.5198 1051.3366 1093.7825 1103.2459 1124.4558 1128.3619 1142.8734 1187.5460 1206.8007 1210.1816 1219.3801 1241.5633 1260.7539 1267.0720 1280.7587 1300.1431 1356.4614 1358.9517 1369.7511 1376.8114 1398.9676 1418.3051 1418.5200 1450.7942 1459.3090 1475.0210 1476.9807 1493.8403 1510.3261 1581.0024 1590.0798 1601.2593 1603.4611 1651.1074 2985.3590 3010.8049 3061.6471 3087.3523 3130.3332 3162.0078 3168.2282 3169.4862 3187.1723 3190.3232 3198.1839 3522.4549 3545.2409
redmass: 10.8118 10.4452 12.7480 8.4054 5.4733 9.2520 11.3794 10.2600 8.0054 6.1731 6.8781 7.1987 8.8578 4.2004 13.2816 5.6320 5.3150 7.3769 7.7507 7.4794 5.6738 8.0737 4.0189 7.5764 7.5349 11.6170 5.7593 6.9352 5.7592 4.3397 2.9999 3.3304 5.6102 1.8223 7.1638 3.3173 3.0488 3.9161 5.5523 8.3876 6.4287 1.3152 4.7568 6.7360 5.6791 5.7032 8.0005 4.0446 3.8920 4.3759 6.4358 3.4829 1.4306 1.7481 5.7409 16.4765 1.4419 2.9755 4.1698 1.4154 1.3478 1.3616 5.3838 5.0955 4.6209 1.3980 3.0779 2.7155 2.4397 1.9645 3.5028 1.4846 2.7489 1.2680 1.1297 1.3533 3.8657 1.7300 2.2037 1.5383 1.5327 1.9016 1.4951 1.5586 3.8513 2.2234 1.9204 7.8591 5.4190 5.2181 1.1002 1.3195 2.1980 2.0633 1.8182 2.4631 8.1452 6.2742 5.5861 7.3302 4.3707 1.0557 1.0643 1.1070 1.1017 1.0903 1.0916 1.0889 1.0957 1.0930 1.0963 1.0951 1.0766 1.0776
irintensity: 1.9012 1.8372 0.7665 0.6790 2.8981 0.7214 0.5656 0.9450 9.4082 0.6338 4.7832 2.7681 0.6473 5.7197 3.1935 0.7442 10.8446 4.6552 3.7042 7.3644 3.4335 9.1581 5.4573 0.2762 9.1927 20.9297 11.1331 1.9305 4.7382 3.2993 0.0240 1.9685 58.8792 28.4890 12.5989 20.7114 19.5381 2.4913 18.5480 209.2576 4.1166 163.2705 60.9375 34.5018 12.9699 61.8313 21.3454 1.5009 1.6047 9.3377 4.0365 16.3432 27.6617 35.6096 12.5549 133.5747 64.3773 9.5223 88.9586 25.6541 1.2872 1.8071 9.8048 23.8324 80.0843 8.6180 23.0686 67.4645 85.0984 23.7583 32.8434 12.5103 3.9960 66.4159 51.6919 283.5901 397.9294 253.7867 408.9018 74.0745 105.5188 11.7125 50.1606 13.2143 49.4943 107.2150 87.9545 75.5803 6.4727 40.1513 52.4262 129.5075 123.3646 59.3510 312.9500 758.3147 11.7143 83.6559 143.2409 107.9243 204.6169 26.4450 33.2692 43.3679 5.8562 10.8632 3.9672 4.2561 6.4729 7.8684 7.4328 14.2990 5.2423 78.2990
temp: 298.150 k
press: 1.00000 atm
elementType: 17 16 9 8 8 8 8 8 8 7 7 7 6 6 6 6 6 6 6 6 6 6 6 6 6 6 6 1 1 1 1 1 1 1 1 1 1 1 1 1
symmnumber: 1
zpe: 714217.0 jmol-1
zpe.correction: 0.272031 hartree
zpe.thermalcorrener: 0.298227 hartree
zpe.thermalcorrenthalpy: 0.299171 hartree
zpe.thermalcorrgfe: 0.209380 hartree
zpe.sumelectzpe: -2150.756546 hartree
zpe.sumelectthermal: -2150.730350 hartree
zpe.sumelectthermalent: -2150.729406 hartree
zpe.sumelectthermalfe: -2150.819197 hartree
dipole: 6.6620 4.5149 2.0974
dipole: 8.3166
quadrupole: -305.3397 -175.0119 -170.5278
quadrupole: 19.8052 -4.2666 -8.8475
quadrupole: -88.3799 41.9479 46.4320 19.8052 -4.2666 -8.8475
hfenergy: -2151.0285768 hartree
pointgroup: C01 [X(C15H13Cl1F1N3O6S1)]
dipole: -2.6491414 -1.8851071 0.3665911 debye
polarizability: 392.7030772|-9.0732556|198.9521567|-3.6944206|31.7710653|223.7764347 unknown
InChI: InChI=1S/C15H13ClFN3O6S/c16-13-9-11(20(22)23)3-6-14(13)26-8-7-18-15(21)19-10-1-4-12(5-2-10)27(17,24)25/h1-6,9,18-19H,7-8H2
charge 0 multiplicity 1
40 atoms
Cl -3.469446 -0.236679 2.917341
S  7.485254 0.93722 -0.419867
F  8.416048 -0.421618 0.451445
O  -2.938632 -1.519825 0.323175
O  1.435281 -2.471053 -1.338647
O  7.905371 0.824603 -1.967259
O  7.745341 2.263035 0.452685
O  -8.035395 2.143908 -0.912392
O  -7.699775 2.577675 1.304887
N  -0.219156 -2.122906 0.272319
N  1.856723 -1.069682 0.523298
N  -7.393688 1.986101 0.1979
C  -1.195025 -2.984679 -0.398637
C  -2.404272 -2.18543 -0.891311
C  3.172768 -0.639959 0.253171
C  5.764065 0.302916 -0.149505
C  -4.029459 -0.674902 0.213564
C  3.775041 0.241075 1.200131
C  3.899748 -1.039904 -0.906257
C  5.081767 0.71632 1.008959
C  5.209088 -0.565895 -1.104897
C  1.051049 -1.927076 -0.261341
C  -4.422004 0.015848 1.396488
C  -4.767577 -0.463149 -0.980806
C  -6.23428 1.0692 0.20005
C  -5.517046 0.883935 1.405164
C  -5.871178 0.407965 -0.991314
H  -0.685674 -3.458724 -1.255376
H  -1.537208 -3.777592 0.291732
H  -2.108228 -1.41604 -1.629388
H  -3.172346 -2.855987 -1.322827
H  -0.551451 -1.609825 1.091518
H  3.218325 0.553442 2.091744
H  3.432206 -1.716068 -1.62336
H  1.455339 -0.725146 1.398585
H  5.550615 1.395556 1.727117
H  5.779185 -0.859659 -1.991795
H  -4.482801 -0.979399 -1.90119
H  -5.824229 1.416291 2.308618
H  -6.452747 0.582604 -1.899825
