program: Gaussian 09
title: 000278705
version: EM64L-G09RevD.01
frameworkgroup: C1[X(C27H17NO2)]
method: RPBEPBE
basis: SDD
operation: Freq
keyword: #p
keyword: freq=noraman
keyword: PBEPBE/SDD
title: #p freq=noraman PBEPBE/SDD
converged: YES YES NO NO
title: Mulliken charges:
elementType: O O N C C C C C C C C C C C C C C C C C C C C C C C C C C C H H H H H H H H H H H H H H H H H
charge: -0.195774 -0.206017 -0.359917 0.177861 -0.681716 0.222748 0.288871 0.156853 0.341036 -0.430457 -0.356855 -0.429803 -0.387557 0.013179 0.020555 -0.225292 0.110360 0.128884 0.294046 0.297522 -0.237706 -0.236968 -0.367978 -0.365554 -0.399443 -0.399511 -0.238029 -0.238345 -0.241742 -0.241516 0.284056 0.244531 0.240875 0.248418 0.243281 0.237605 0.227297 0.224727 0.225384 0.278722 0.278229 0.251625 0.251349 0.240392 0.240243 0.235831 0.235697
chargesum: 0.00000
title: Mulliken charges with hydrogens summed into heavy atoms:
elementType: O O N C C C C C C C C C C C C C C C C C C C C C C C C C C C
charge: -0.195774 -0.206017 -0.359917 0.177861 -0.153129 0.222748 0.288871 0.156853 0.341036 -0.189582 -0.108437 -0.186521 -0.149952 0.013179 0.020555 0.002005 0.110360 0.128884 0.294046 0.297522 -0.012979 -0.011584 -0.089255 -0.087325 -0.147818 -0.148162 0.002364 0.001898 -0.005911 -0.005819
polarizability: 4.04465948e+02 -8.66679731e+00 3.07291790e+02 -1.03819974e+01 -1.49832576e+01 2.30615979e+02
1716.lowfreq: -1.6217 -0.0004 0.0001 0.0004 4.1560 5.3752 17.2850 19.1323 47.9644
frequency: 17.2294 19.0790 47.9612 60.4201 73.0493 96.2976 102.3632 121.3787 125.9531 130.4505 175.4554 214.4857 221.5424 223.6391 260.7388 281.1660 284.4693 308.5716 346.3779 348.0938 374.0478 394.2610 424.2337 427.5684 440.3901 449.1247 458.4243 471.6589 511.0345 523.3290 549.0047 556.6594 558.4368 565.9501 598.8465 614.8606 620.3278 626.0946 661.0460 662.6116 683.5928 699.7957 706.7636 732.6082 741.1074 746.2383 766.7504 775.3467 780.9437 787.1605 788.3928 797.1053 805.1894 830.5368 869.9600 879.2573 884.3958 887.8095 897.2530 909.6885 931.6858 962.5459 967.0011 972.3045 977.2752 985.5807 994.9627 998.4244 998.6229 1018.5798 1032.9294 1055.1562 1057.3165 1062.3276 1080.4189 1105.1227 1124.4380 1125.4833 1133.8391 1138.8364 1168.2033 1173.7482 1180.5646 1182.6032 1187.5749 1195.8961 1211.0409 1230.7825 1238.3486 1259.0735 1281.2331 1282.6106 1289.4938 1302.6563 1306.7707 1375.2121 1381.2518 1381.7816 1389.7027 1422.7989 1427.6004 1428.0144 1433.9193 1451.1332 1470.1387 1471.3590 1482.6542 1496.9512 1550.4680 1563.2189 1585.7497 1591.1171 1591.8130 1595.8172 1608.0971 1609.5521 1621.7552 1624.3821 2984.3863 3031.7584 3120.6920 3127.8472 3132.2136 3133.8554 3135.6470 3141.4026 3147.2465 3150.0588 3150.4308 3160.3877 3160.3975 3162.1068 3170.1859 3174.3163 3174.7567
redmass: 5.9012 6.0649 4.6248 9.0046 4.8400 5.5050 5.4228 4.4640 4.1762 6.9256 6.1824 4.9271 3.5764 3.7260 3.0422 5.3914 5.3630 5.4496 5.5409 6.6877 8.0847 8.2988 3.2685 4.1383 4.7027 4.4113 4.7245 2.8435 8.0041 4.0111 5.2735 5.2293 3.5032 5.0332 4.6144 6.9632 6.5005 5.7862 6.5253 6.3714 5.2292 3.2103 3.7348 1.6563 5.8015 1.8459 1.4600 4.7996 2.5498 1.9552 2.1418 3.9472 2.1239 5.2409 1.4410 3.9388 1.4266 3.8636 1.7112 1.5621 1.7557 1.7734 1.3893 1.4003 1.3933 1.3286 7.1432 1.3538 1.3540 2.6829 3.9376 2.3334 2.5006 2.0828 2.8616 1.9402 1.9594 1.7694 1.1622 3.9009 1.1464 1.2052 1.0662 1.0753 2.2215 2.3723 1.9647 2.5813 2.5248 1.6925 2.7529 1.7075 1.8413 2.4384 2.3836 9.4948 6.5338 7.3715 3.2141 2.2672 1.9616 1.2862 2.6799 2.7575 3.2710 2.4253 3.3523 2.9792 10.9264 7.5838 8.2647 7.9544 6.8998 6.8183 6.2070 7.2135 7.8465 8.1452 1.0612 1.0987 1.0852 1.0894 1.0870 1.0859 1.0857 1.0947 1.0903 1.0898 1.0928 1.0998 1.0956 1.0947 1.0982 1.0999 1.1000
irintensity: 0.6842 0.5682 0.9151 2.0253 0.8145 0.9104 1.6090 1.9559 3.4780 0.9672 1.3981 0.4110 1.6272 3.4538 6.7433 5.3250 2.4169 0.1135 0.5719 1.3717 3.7749 10.7944 6.2372 0.5986 0.8462 2.4717 1.4528 1.0353 7.9391 0.9173 6.0855 0.1274 5.6879 3.6419 0.7664 2.4266 25.1192 7.6897 2.1687 12.1695 2.5100 11.4029 28.4457 4.5175 8.3651 114.3596 100.2681 7.0782 3.2616 7.1523 35.5553 2.6310 12.9364 5.2261 0.2509 11.3338 0.8111 5.1701 2.5278 10.3887 3.4139 8.5033 3.9125 0.0720 1.3540 0.0638 1.0555 0.2749 1.3229 10.6489 2.4029 14.4376 4.8140 3.9122 12.0006 2.3306 27.2995 27.8376 2.2492 55.3970 0.5402 1.4931 0.1117 0.4147 9.3869 2.3738 16.6986 121.5197 91.0575 2.0665 136.0001 49.3258 9.1192 61.0173 49.2228 12.5339 10.0453 18.1725 6.9755 2.6295 27.9840 13.6631 13.8397 29.4352 4.0345 10.5246 2.8459 0.1327 227.7042 7.8347 57.0503 37.5633 7.9067 52.6162 11.6441 15.0650 7.5977 11.0605 8.4290 3.3975 2.8319 4.4678 3.8686 3.0848 1.8967 27.2237 17.1268 0.4243 23.4877 48.0155 0.9205 19.9945 12.5747 26.7111 12.2444
temp: 298.150 k
press: 1.00000 atm
elementType: 8 8 7 6 6 6 6 6 6 6 6 6 6 6 6 6 6 6 6 6 6 6 6 6 6 6 6 6 6 6 1 1 1 1 1 1 1 1 1 1 1 1 1 1 1 1 1
symmnumber: 1
zpe: 938722.6 jmol-1
zpe.correction: 0.357541 hartree
zpe.thermalcorrener: 0.379749 hartree
zpe.thermalcorrenthalpy: 0.380694 hartree
zpe.thermalcorrgfe: 0.305100 hartree
zpe.sumelectzpe: -1242.317534 hartree
zpe.sumelectthermal: -1242.295325 hartree
zpe.sumelectthermalent: -1242.294381 hartree
zpe.sumelectthermalfe: -1242.369975 hartree
dipole: 3.3029 1.1865 -1.2542
dipole: 3.7269
quadrupole: -138.3178 -153.9876 -179.4701
quadrupole: 1.0611 -7.9488 -8.8730
quadrupole: 18.9407 3.2709 -22.2116 1.0611 -7.9488 -8.8730
hfenergy: -1242.6750745 hartree
pointgroup: C01 [X(C27H17N1O2)]
dipole: -1.2509602 -0.6719025 -0.3655163 debye
polarizability: 405.5112141|3.5645519|309.5627847|3.1317226|4.5177353|227.2997185 unknown
InChI: InChI=1S/C27H17NO2/c29-26-22-12-5-3-10-20(22)21-11-4-6-13-23(21)27(30)28(26)25-15-7-14-19-18-9-2-1-8-17(18)16-24(19)25/h1-15H,16H2
charge 0 multiplicity 1
47 atoms
O  -0.512985 -0.360577 2.773378
O  -0.431566 1.388717 -1.541123
N  -0.506329 0.493096 0.605037
C  1.960327 0.602925 0.254155
C  2.118594 -0.517412 -0.759961
C  3.226384 1.198055 0.539904
C  3.621693 -0.531934 -1.01252
C  4.257726 0.49065 -0.24395
C  0.804972 1.097942 0.876784
C  3.328587 2.277066 1.444286
C  0.896061 2.176285 1.786353
C  4.378265 -1.365404 -1.854142
C  5.655189 0.681213 -0.318627
C  -1.002317 -0.402044 1.611538
C  -1.131472 0.871871 -0.62509
C  2.153463 2.760423 2.064925
C  -1.916656 -1.52569 1.208539
C  -2.631065 0.864917 -0.725446
C  -3.032243 -1.438706 0.325295
C  -3.508213 -0.1604 -0.265133
C  5.781427 -1.174835 -1.928555
C  6.412728 -0.159547 -1.166867
C  -1.596569 -2.768618 1.822831
C  -3.163774 2.010247 -1.380165
C  -3.757686 -2.63262 0.045381
C  -4.909551 0.034203 -0.433214
C  -2.328268 -3.934445 1.534842
C  -4.550638 2.180797 -1.537923
C  -3.411005 -3.865677 0.62698
C  -5.430484 1.187187 -1.048095
H  1.545101 -0.288008 -1.678733
H  1.74462 -1.488649 -0.380506
H  4.298574 2.735286 1.666491
H  -0.009033 2.540859 2.280899
H  3.896582 -2.150394 -2.448511
H  6.14998 1.46379 0.267789
H  2.21208 3.593409 2.773555
H  6.384365 -1.816564 -2.580886
H  7.498193 -0.026471 -1.237361
H  -0.764531 -2.789885 2.532891
H  -2.459953 2.755395 -1.76244
H  -4.590244 -2.590623 -0.66416
H  -5.598413 -0.723392 -0.046005
H  -2.055636 -4.884182 2.00627
H  -4.940966 3.077534 -2.029894
H  -3.980499 -4.766673 0.375096
H  -6.514414 1.311285 -1.144211
