program: Gaussian 09
title: 000278651
version: EM64L-G09RevD.01
frameworkgroup: C1[X(C10H13BrO)]
method: RPBEPBE
basis: SDD
operation: Freq
keyword: #p
keyword: freq=noraman
keyword: PBEPBE/SDD
title: #p freq=noraman PBEPBE/SDD
converged: NO YES NO NO
title: Mulliken charges:
elementType: Br O C C C C C C C C C C H H H H H H H H H H H H H
charge: -0.026127 -0.431190 0.138384 0.117150 0.484803 0.489257 -0.073666 -0.603497 -0.844131 -0.816663 -0.861611 -0.863942 0.284082 0.227302 0.227411 0.250896 0.250820 0.188806 0.255616 0.255634 0.251328 0.258940 0.258964 0.242844 0.338592
chargesum: 0.00000
title: Mulliken charges with hydrogens summed into heavy atoms:
elementType: Br O C C C C C C C C C C
charge: -0.026127 -0.092599 0.138384 0.117150 0.484803 0.489257 -0.073666 -0.603497 -0.105337 -0.126140 -0.099033 -0.103194
polarizability: 1.71553553e+02 -9.55461771e-01 1.49406276e+02 5.41826598e-03 -9.84259104e-03 6.81813656e+01
1716.lowfreq: -18.2131 0.0004 0.0004 0.0006 6.4062 11.3986 15.5500 71.9992 106.4071
frequency: -13.3834 71.9845 106.3976 123.1835 135.6495 155.3795 174.7053 191.4831 210.8191 237.7326 274.7176 332.4450 348.2850 355.8467 356.4123 361.3521 391.3076 438.0763 496.0540 567.4099 577.5409 592.5161 607.5984 712.5436 750.9247 831.1674 923.3671 1002.0900 1012.7917 1019.5032 1026.3618 1042.3796 1046.6110 1053.8701 1073.5055 1089.5323 1183.1443 1210.9893 1324.8666 1351.9414 1391.7585 1397.8143 1402.2545 1405.1266 1417.3960 1444.8637 1457.1637 1458.4121 1468.1543 1474.9257 1481.6269 1484.6103 1497.2229 1499.2601 1562.1292 1609.1075 2971.0566 2979.4732 2985.0457 2985.5638 3044.7875 3050.5558 3055.4223 3055.6011 3061.2484 3112.0153 3115.1319 3120.2414 3596.2620
redmass: 1.2589 3.4722 1.6840 1.2270 1.4185 1.8625 1.1680 6.1707 1.9939 8.0795 1.2486 3.3272 2.9573 2.7939 3.5417 4.0754 3.4267 4.9786 5.0156 5.3194 3.5460 2.8398 5.7612 4.3404 4.4333 2.9966 2.6273 1.3681 1.6907 1.3989 1.4030 1.9890 1.5798 1.5748 2.3239 2.5903 1.5511 5.0956 7.7587 5.7403 3.0881 1.2288 1.2566 1.2323 1.3870 2.1601 1.0437 1.2936 1.0454 1.2278 1.2099 1.0435 1.0456 1.1154 5.1459 6.7601 1.0380 1.0400 1.0396 1.0395 1.0953 1.0976 1.0969 1.0969 1.0992 1.0957 1.0961 1.0952 1.0648
irintensity: 1.3531 0.0206 0.4281 0.0469 2.2266 3.9428 0.1372 0.1844 3.0246 4.0237 103.4247 2.2596 3.2680 0.9067 11.6090 4.2859 4.5946 0.1257 7.8593 4.6160 0.1601 8.9383 0.0424 27.1489 2.5540 13.5673 10.4502 36.6003 43.0834 6.6592 7.3467 8.4448 0.7535 0.1444 74.9599 27.3366 145.1190 37.4009 8.5206 7.4229 30.5273 3.3407 15.0327 32.4568 17.9981 0.1498 23.1985 0.8870 22.4214 5.9709 32.4422 0.0012 4.0320 55.2080 5.8466 1.9316 46.5631 30.4540 29.1612 8.5715 36.3988 22.4749 22.7716 1.7451 13.9415 23.1326 19.3476 3.4999 25.2759
temp: 298.150 k
press: 1.00000 atm
elementType: 35 8 6 6 6 6 6 6 6 6 6 6 1 1 1 1 1 1 1 1 1 1 1 1 1
symmnumber: 1
zpe: 528430.7 jmol-1
zpe.correction: 0.201269 hartree
zpe.thermalcorrener: 0.214328 hartree
zpe.thermalcorrenthalpy: 0.215272 hartree
zpe.thermalcorrgfe: 0.161941 hartree
zpe.sumelectzpe: -476.648374 hartree
zpe.sumelectthermal: -476.635315 hartree
zpe.sumelectthermalent: -476.634371 hartree
zpe.sumelectthermalfe: -476.687702 hartree
dipole: -1.8536 1.7314 -0.0005
dipole: 2.5365
quadrupole: -81.1094 -70.6151 -84.3082
quadrupole: -6.8713 0.0066 -0.0017
quadrupole: -2.4318 8.0625 -5.6306 -6.8713 0.0066 -0.0017
hfenergy: -476.8496431 hartree
pointgroup: C01 [X(C10H13Br1O1)]
dipole: -0.7307766 -0.6791799 0.022916 debye
dipolederiv: -0.7312029 0.0010682 0.0126482 0.0053162 -0.0812667 0.0001889 0.0123974 0.0003276 -0.0592093 -1.4414614 -0.0361256 0.0200402 -0.0058078 -0.1467578 -0.0038028 0.0193058 -0.0032905 -0.4009469 -0.1369732 -0.1341694 0.0028052 -0.2601364 0.1436154 0.0016511 0.004645 -0.000898 -0.0843001 -0.1858458 0.0804791 0.0006504 0.1978756 0.0633077 -0.0055531 -0.0008181 -0.0029517 -0.1012534 -0.1478419 0.1908955 0.0005095 0.0687964 0.1759414 -0.003406 0.0021064 -0.0057927 0.0156862 -0.1535489 -0.1234629 0.0049886 -0.0536179 0.1596127 -0.0009924 0.0040966 0.0001209 0.0251138 1.2184925 0.0527199 -0.0225092 0.0754316 -0.0123944 -0.0004213 -0.0227609 -0.000036 0.0615021 1.0959651 -0.0183519 -0.0243421 -0.0034139 -0.2193694 0.0001933 -0.0243585 0.0005144 -0.2083322 -0.0536279 0.0245676 0.0023774 0.0778782 -0.1174789 0.0013125 0.0019573 0.0027112 0.0848063 0.0678793 -0.0400128 0.0007163 -0.0595082 -0.0888809 0.0029781 0.0007815 0.002271 0.0777959 -0.0500217 -0.1349188 0.0038802 -0.1117539 -0.0577723 0.003628 0.0035554 0.0041006 0.0544781 -0.0443 0.1328803 -0.0001177 0.1172702 -0.0444484 -0.0008872 0.0003695 -0.0011343 0.0501154 -0.0668606 0.0296009 0.0033657 -0.0490521 0.1355139 0.0007746 0.0045097 -0.0008612 0.1151598 0.0769973 -0.0125306 -0.0698174 0.0242583 -0.0441998 -0.0888239 -0.0296288 -0.1231069 -0.0422533 0.0809077 -0.0052667 0.0648282 0.0290769 -0.0381416 0.0875628 0.0233379 0.1232741 -0.0523153 0.0782087 0.0168201 0.0595847 -0.0283234 -0.0398272 -0.080878 0.0141789 -0.1148457 -0.0297964 0.0754434 0.0191311 -0.0636572 -0.02588 -0.0349729 0.0822045 -0.0171181 0.1146305 -0.0321695 -0.2312446 0.0028555 0.0059385 0.1060224 0.0758959 -0.0014887 0.0046639 0.0002986 0.1029943 0.0197327 -0.0562503 -0.0914717 -0.0215712 0.0510742 0.0131315 -0.1028538 -0.0291639 -0.0262554 0.0269731 -0.0526736 0.0908856 -0.0193296 0.0514914 -0.0145775 0.1014044 0.0289963 -0.0339075 0.0353736 0.160084 -0.0010252 0.0754295 -0.0695483 0.0008585 0.0000873 -0.0008157 0.0976342 0.0274174 0.0572898 0.088114 0.022026 0.0486222 0.0110305 0.0984413 -0.0338655 -0.0312495 0.0202017 0.0559417 -0.0916017 0.0187669 0.0491607 -0.013951 -0.1011309 0.0295863 -0.024679 0.0233421 -0.1650441 0.0036744 -0.083031 -0.0787093 0.0039506 0.0025101 0.0054934 0.0965259 0.3959942 -0.0455272 -0.0004649 -0.0967231 0.1195324 0.0053167 0.0003208 0.0044371 0.344856 unknown
polarizability: 171.5218443|0.8759622|149.3865542|-1.9452464|-1.1132628|68.2327954 unknown
InChI: InChI=1S/C10H13BrO/c1-5-7(3)10(12)8(4)6(2)9(5)11/h12H,1-4H3
charge 0 multiplicity 1
25 atoms
Br 3.310212 -0.012971 -0.045673
O  -2.849022 0.105798 0.068163
C  -0.753419 1.256103 0.013515
C  -0.767488 -1.242108 0.047181
C  0.66983 1.25165 -0.013168
C  0.65903 -1.252833 0.020974
C  -1.440017 0.01218 0.042973
C  1.327495 -0.004955 -0.008412
C  -1.551184 2.549968 0.010895
C  -1.539876 -2.556191 0.077696
C  1.454652 2.549762 -0.045509
C  1.437249 -2.556898 0.024418
H  -2.628649 2.33249 0.036146
H  -1.307072 3.178732 0.888008
H  -1.343643 3.152351 -0.893779
H  -1.320166 -3.176197 -0.810969
H  -1.289208 -3.153824 0.973496
H  -2.638972 -2.427796 0.095197
H  2.130632 2.625508 0.826621
H  2.0974 2.601596 -0.944119
H  0.793716 3.428866 -0.045013
H  2.080365 -2.635323 -0.871931
H  2.113255 -2.610816 0.898078
H  0.778851 -3.438095 0.048747
H  -3.259271 -0.791898 0.089066
