program: Gaussian 09
title: 000278656
version: EM64L-G09RevD.01
frameworkgroup: C1[X(C16H18O2)]
method: RPBEPBE
basis: SDD
operation: Freq
keyword: #pfreq=noraman
keyword: PBEPBE/SDD
title: #p freq=noraman PBEPBE/SDD
converged: YES YES NO NO
title: Mulliken charges:
elementType: O O C C C C C C C C C C C C C C C C H H H H H H H H H H H H H H H H H H
charge: -0.312859 -0.430083 0.006065 0.392045 0.395765 0.399389 0.351396 0.351333 -0.059304 -0.607308 -0.566917 -0.419420 -0.419432 -0.227966 -0.865640 -0.792915 -0.808223 -0.808360 0.260772 0.272283 0.234053 0.234057 0.231855 0.231902 0.252614 0.238975 0.215623 0.238925 0.223375 0.245643 0.218476 0.247368 0.245585 0.247499 0.218521 0.364907
chargesum: 0.00000
title: Mulliken charges with hydrogens summed into heavy atoms:
elementType: O O C C C C C C C C C C C C C C C C
charge: -0.312859 -0.065175 0.006065 0.392045 0.395765 0.399389 0.351396 0.351333 -0.059304 -0.346536 -0.294634 -0.185367 -0.185375 -0.004590 -0.149269 -0.099392 -0.096736 -0.096755
polarizability: 2.38454932e+02 -2.03038378e+01 1.55659596e+02 6.74134655e-02 1.63718424e-02 1.47643399e+02
1716.lowfreq: -13.2350 -0.0001 0.0005 0.0006 7.5474 11.6239 16.1741 29.6173 58.6570
frequency: 14.5650 29.3734 58.6539 92.9353 110.1969 110.5721 115.3513 123.7290 136.9625 161.5913 200.6210 222.4874 226.4449 257.6791 273.1780 285.4974 293.4428 299.8492 314.2849 362.4147 438.2852 468.7716 485.6175 504.1814 507.4281 513.2694 538.0004 542.2417 562.0879 583.1661 616.7547 669.1507 721.1314 734.4395 754.4851 779.3907 815.2614 868.0413 874.5141 896.2481 918.0123 941.6581 953.4183 972.1786 985.2068 1009.6565 1022.5954 1041.2470 1042.7536 1046.2972 1046.4202 1048.5730 1086.7477 1120.2224 1161.3585 1170.0109 1175.6705 1214.5324 1256.0708 1257.8037 1276.4837 1320.5846 1370.9250 1387.9860 1398.6714 1398.9692 1399.2605 1403.2272 1428.2633 1431.6396 1442.2603 1452.8734 1456.9536 1461.0008 1461.8449 1477.7719 1483.1267 1483.9792 1483.9891 1492.3699 1596.1326 1608.2254 1608.6621 1629.5479 2952.4307 2981.9207 2982.4214 2983.4916 3020.1614 3060.9184 3061.0601 3061.2481 3089.6938 3092.3379 3092.6109 3092.7807 3120.8866 3130.9445 3145.1159 3154.4487 3155.9163 3583.7489
redmass: 4.2180 3.6592 4.5955 1.0298 1.2712 1.1042 2.6703 1.9517 1.2297 2.7871 3.7833 2.4448 2.8837 3.2026 2.7162 2.1495 1.8948 3.6936 3.6181 5.2685 5.5146 3.4935 5.0707 3.2510 4.5215 3.0903 5.6317 4.7439 3.9602 3.5277 4.1559 5.0376 3.8080 5.0269 4.8181 1.2324 5.3228 1.3333 1.4383 1.3097 2.5072 2.7859 3.5396 1.3358 1.6264 1.8576 1.5301 1.8073 1.5157 1.5148 1.5503 1.5174 1.8195 1.9648 2.2836 3.1996 1.1631 2.0586 1.4259 1.5778 3.1340 4.9622 6.5835 2.8466 1.2646 1.3661 1.2481 1.4401 2.4650 2.4723 2.0511 1.8045 1.0459 1.0484 1.0689 1.0439 1.2649 1.2754 1.2786 1.4902 5.5539 8.0953 6.5061 7.2618 1.0402 1.0372 1.0372 1.0365 1.0980 1.0963 1.0963 1.0968 1.0943 1.1002 1.1001 1.1002 1.0856 1.0920 1.0913 1.0923 1.0993 1.0654
irintensity: 0.1747 0.4539 0.2622 0.1506 1.4853 0.1866 0.0052 0.6113 0.0018 1.3705 0.1574 16.3655 1.6948 7.5503 2.8757 64.4900 34.5149 1.1393 8.6133 12.1101 2.2653 1.3773 0.8999 0.4109 0.9116 0.0056 0.0776 2.2631 7.2414 0.9238 0.8426 0.9468 2.3965 19.9182 5.5116 68.4667 8.2378 9.6942 25.0649 0.0497 5.2281 6.2308 25.6478 0.2000 7.4105 60.1279 36.6872 0.0636 8.9880 2.5460 12.6819 1.9647 70.3933 1.9271 429.8020 23.5793 1.2412 28.5612 13.3338 0.1922 12.9574 62.0931 2.9514 20.6117 20.4516 37.6685 5.1831 18.9033 44.1216 34.0723 24.0868 0.5797 9.9469 27.8095 0.0020 14.6360 76.0834 26.1939 24.5392 96.3478 9.3858 3.5156 19.2521 23.8669 43.2211 40.8914 5.0843 26.7122 22.8417 4.5147 30.1699 13.2020 12.8793 18.7963 8.3907 36.5331 0.1910 25.3132 4.2201 3.8124 35.8760 34.5672
temp: 298.150 k
press: 1.00000 atm
elementType: 8 8 6 6 6 6 6 6 6 6 6 6 6 6 6 6 6 6 1 1 1 1 1 1 1 1 1 1 1 1 1 1 1 1 1 1
symmnumber: 1
zpe: 770093.7 jmol-1
zpe.correction: 0.293313 hartree
zpe.thermalcorrener: 0.311997 hartree
zpe.thermalcorrenthalpy: 0.312941 hartree
zpe.thermalcorrgfe: 0.245607 hartree
zpe.sumelectzpe: -769.643687 hartree
zpe.sumelectthermal: -769.625004 hartree
zpe.sumelectthermalent: -769.624059 hartree
zpe.sumelectthermalfe: -769.691393 hartree
dipole: 1.1037 -0.3941 0.0039
dipole: 1.1719
quadrupole: -91.9550 -107.2493 -102.7762
quadrupole: -11.7086 0.0231 -0.0014
quadrupole: 8.7051 -6.5891 -2.1160 -11.7086 0.0231 -0.0014
hfenergy: -769.9370002 hartree
pointgroup: C01 [X(C16H18O2)]
dipole: 0.4372691 -0.1461981 0.00228 debye
polarizability: 239.2454322|-18.6049822|154.8690015|0.176176|-0.0181606|147.643494 unknown
InChI: InChI=1S/C16H18O2/c1-10-6-5-7-11(2)16(10)18-14-8-12(3)15(17)13(4)9-14/h5-9,17H,1-4H3
charge 0 multiplicity 1
36 atoms
O  -0.627422 -1.315414 0.002642
O  4.402164 1.223426 -0.003717
C  -1.839216 -0.557873 0.00128
C  0.615337 -0.626393 0.001033
C  3.051831 -0.85804 0.004986
C  2.003171 1.394846 -0.007516
C  -2.438696 -0.250944 -1.246778
C  -2.434595 -0.239035 1.24836
C  3.149902 0.560816 -0.001952
C  1.765772 -1.442059 0.006389
C  0.727639 0.781845 -0.005967
C  -3.69034 0.413524 -1.224846
C  -3.686304 0.425235 1.224253
C  -4.309925 0.751446 -0.000857
C  4.306143 -1.715078 0.01056
C  2.161279 2.900655 -0.014869
C  -1.755849 -0.632309 -2.5449
C  -1.747684 -0.608295 2.547829
H  1.644759 -2.529743 0.011595
H  -0.171479 1.407093 -0.010369
H  -4.17833 0.661097 -2.174855
H  -4.171191 0.681782 2.173467
H  4.935638 -1.539529 -0.885739
H  4.933415 -1.531314 0.906779
H  4.047162 -2.786316 0.015151
H  2.734876 3.235017 -0.898874
H  1.180023 3.404383 -0.020135
H  2.729979 3.244143 0.868827
H  -5.279242 1.262263 -0.001711
H  -1.51848 -1.711184 -2.565317
H  -2.394511 -0.394741 -3.41235
H  -0.795251 -0.097306 -2.666883
H  -1.509649 -1.686828 2.57724
H  -0.787069 -0.071646 2.662026
H  -2.383884 -0.363257 3.415008
H  5.142127 0.567332 0.00021
