program: Gaussian 09
title: 000278650
version: EM64L-G09RevD.01
frameworkgroup: C1[X(C7H16N4O3)]
method: RPBEPBE
basis: SDD
operation: Freq
keyword: #p
keyword: freq=noraman
keyword: PBEPBE/SDD
title: #p freq=noraman PBEPBE/SDD
converged: NO YES NO NO
title: Mulliken charges:
elementType: O O O N N N N C C C C C C C H H H H H H H H H H H H H H H H
charge: -0.489440 -0.305513 -0.281721 -0.376751 -0.375957 -0.500757 -0.506410 -0.140930 -0.236517 -0.140006 -0.689014 -0.750277 0.246431 0.136737 0.233079 0.232155 0.252025 0.224979 0.215129 0.252579 0.212937 0.279640 0.195369 0.377055 0.330922 0.385901 0.311734 0.311727 0.298032 0.296862
chargesum: 0.00000
title: Mulliken charges with hydrogens summed into heavy atoms:
elementType: O O O N N N N C C C C C C C
charge: -0.112385 -0.305513 -0.281721 -0.045830 0.009944 0.122705 0.088483 0.092149 -0.004362 0.112019 0.003674 -0.062331 0.246431 0.136737
polarizability: 1.36641180e+02 -6.45413992e+00 1.08252787e+02 -1.81794461e+00 3.29075734e+00 9.87795797e+01
1716.lowfreq: -15.1949 -5.0688 -0.0007 0.0006 0.0010 3.3622 34.9570 44.6609 52.2692
frequency: 34.8543 44.6089 52.2229 81.3092 95.2149 116.8642 141.2971 153.6913 177.1961 186.5219 197.4268 204.0368 237.0501 253.5631 272.3013 324.8372 339.4217 343.4241 355.0034 385.2909 397.5072 501.7840 552.6192 597.0594 616.4672 695.5982 719.5381 736.9662 741.2720 764.6257 795.9921 846.9934 876.5514 888.1838 909.5024 939.6591 956.9109 1015.6369 1041.8148 1070.7940 1080.0970 1095.2502 1124.2006 1139.2175 1152.6657 1222.6122 1228.0180 1253.0928 1265.3400 1271.2389 1283.5520 1286.0999 1292.7178 1331.0849 1352.3799 1387.7406 1389.4146 1412.6736 1456.8908 1470.8405 1474.3102 1478.3598 1488.5179 1489.8174 1587.5880 1601.5460 1674.9603 1677.0193 2965.0634 2983.7793 2990.6868 3012.2614 3022.8088 3075.1969 3084.3646 3102.6883 3108.5974 3243.7750 3347.4477 3376.1055 3400.5309 3486.2089 3519.2445 3542.8453
redmass: 5.4064 5.8895 4.2232 4.5663 1.5209 1.4760 2.6728 2.5636 1.2127 2.0431 2.6592 2.9768 1.4251 2.9000 2.9523 3.9128 4.7952 4.0713 5.3602 5.6514 3.8320 4.3479 3.8899 1.1966 3.6186 1.6928 4.5441 1.5508 3.1719 1.7217 1.7309 2.2620 1.2136 3.8158 3.1496 2.5875 1.9924 2.3646 1.9449 2.7720 2.2298 2.2270 2.0037 2.3351 3.0342 1.5301 1.3665 2.0018 1.8369 1.2982 1.2585 1.2429 1.4882 1.2961 1.5562 1.1928 1.1979 1.2606 1.4970 1.1287 1.0679 1.0860 1.0534 1.6208 5.3933 5.9145 1.0626 1.0621 1.0815 1.0374 1.0361 1.0832 1.0864 1.0990 1.1003 1.0978 1.0999 1.0674 1.0799 1.0475 1.0430 1.0976 1.0992 1.0796
irintensity: 0.1227 12.3663 2.5732 2.7015 22.5706 27.9065 2.3561 3.8048 3.4814 13.6122 5.6101 0.8314 4.7669 0.6594 25.3097 9.8576 34.3746 10.7597 9.6232 24.0492 2.7540 6.8284 18.1204 113.2012 1.9530 70.3115 7.9848 123.1170 7.7185 78.0747 113.6455 22.4405 136.8440 26.7454 28.0789 24.7962 43.4195 2.0870 3.8749 5.6895 13.6419 13.8183 19.6596 4.0099 7.2261 80.1852 7.5318 3.4889 15.5988 9.0435 0.6259 0.9083 3.7519 4.1260 7.0418 6.1085 53.7060 200.3787 61.3047 24.1578 27.3725 46.6999 10.3258 217.6085 79.7849 218.9520 21.6035 30.2674 4.0577 32.4450 27.1369 12.6547 39.3660 39.3185 29.0112 7.6047 12.8772 297.2472 206.0861 26.7227 1.5798 0.5171 4.1369 41.6798
temp: 298.150 k
press: 1.00000 atm
elementType: 8 8 8 7 7 7 7 6 6 6 6 6 6 6 1 1 1 1 1 1 1 1 1 1 1 1 1 1 1 1
symmnumber: 1
zpe: 651309.6 jmol-1
zpe.correction: 0.248071 hartree
zpe.thermalcorrener: 0.264856 hartree
zpe.thermalcorrenthalpy: 0.265800 hartree
zpe.thermalcorrgfe: 0.203297 hartree
zpe.sumelectzpe: -719.859737 hartree
zpe.sumelectthermal: -719.842951 hartree
zpe.sumelectthermalent: -719.842007 hartree
zpe.sumelectthermalfe: -719.904510 hartree
dipole: -4.7967 0.3781 1.6775
dipole: 5.0956
quadrupole: -86.1832 -94.3545 -79.3456
quadrupole: -2.8443 -1.9651 -5.4945
quadrupole: 0.4446 -7.7268 7.2822 -2.8443 -1.9651 -5.4945
hfenergy: -720.1078074 hartree
pointgroup: C01 [X(C7H16N4O3)]
dipole: -1.8869105 -0.0138456 0.6770885 debye
polarizability: 136.5524813|-5.9795969|106.0527638|-3.4122909|5.2485298|101.0683015 unknown
InChI: InChI=1S/C7H16N4O3/c1-3(6(13)10-8)5(12)4(2)7(14)11-9/h3-5,10-12H,8-9H2,1-2H3
charge 0 multiplicity 1
30 atoms
O  0.39187 -1.660612 -0.643285
O  -1.886559 -0.357703 -1.316023
O  3.175663 1.315341 0.85334
N  -3.094818 0.661298 0.377912
N  2.85209 -0.577249 -0.451827
N  -3.961705 1.374309 -0.493357
N  4.23464 -0.72423 -0.773989
C  0.207087 -0.941529 0.636231
C  -1.309819 -0.941175 1.011051
C  0.850999 0.480147 0.589576
C  -1.845507 -2.392569 1.147423
C  0.55875 1.305876 1.864372
C  -2.105257 -0.192682 -0.064749
C  2.392176 0.444034 0.355664
H  0.739185 -1.553432 1.389616
H  -1.428127 -0.430478 1.985218
H  0.421309 1.011872 -0.286513
H  -1.303139 -2.917978 1.953919
H  -2.92278 -2.402857 1.392562
H  -1.687717 -2.952094 0.210844
H  0.747401 0.711973 2.778807
H  1.238223 2.173038 1.894482
H  -0.483903 1.670064 1.885864
H  -0.320126 -1.309744 -1.265814
H  -3.274222 0.788091 1.375757
H  2.181088 -1.261244 -0.839159
H  -4.45573 0.723489 -1.120058
H  -3.434318 2.070737 -1.038627
H  4.784759 -0.800303 0.095429
H  4.555587 0.097709 -1.308968
