program: Gaussian 09
title: 000278680
version: EM64L-G09RevD.01
frameworkgroup: C1[X(C16H24N2O2)]
method: RPBEPBE
basis: SDD
operation: Freq
keyword: #p
keyword: freq=noraman
keyword: PBEPBE/SDD
title: #p freq=noraman PBEPBE/SDD
converged: YES YES NO NO
title: Mulliken charges:
elementType: O O N N C C C C C C C C C C C C C C C C H H H H H H H H H H H H H H H H H H H H H H H H
charge: -0.286332 -0.286336 -0.345516 -0.345523 0.172335 0.172321 0.154994 0.154995 0.157561 0.157576 -0.622350 -0.622348 -0.872011 -0.872004 -0.862074 -0.862079 0.258269 0.258269 -0.770233 -0.770228 0.245683 0.278927 0.245673 0.278918 0.235995 0.230036 0.293321 0.293309 0.235994 0.230039 0.238550 0.241577 0.237797 0.241575 0.237803 0.238549 0.297260 0.297262 0.253449 0.253728 0.209047 0.253447 0.253728 0.209048
chargesum: 0.00000
title: Mulliken charges with hydrogens summed into heavy atoms:
elementType: O O N N C C C C C C C C C C C C C C C C
charge: -0.286332 -0.286336 -0.048256 -0.048261 0.172335 0.172321 0.154994 0.154995 0.157561 0.157576 -0.097741 -0.097757 -0.112659 -0.112662 -0.144150 -0.144153 0.258269 0.258269 -0.054009 -0.054005
polarizability: 2.56584803e+02 -1.56604298e-03 2.07582049e+02 5.53255692e+00 1.47731707e-03 1.40135200e+02
1716.lowfreq: -12.1733 -4.3832 -0.0006 -0.0005 -0.0004 5.7301 25.7151 26.4002 36.4397
frequency: 25.7016 26.3886 36.4319 42.2617 53.7875 66.2877 77.0804 79.5998 106.2735 108.4416 127.3781 135.6481 145.5685 153.1101 158.6730 189.7028 201.2612 209.5117 210.5876 274.5091 341.1287 350.2524 354.2852 369.1728 387.2318 413.4837 439.0682 446.3235 454.3364 468.3935 501.1768 547.3879 553.1295 564.4886 567.6067 586.2263 596.6489 608.7964 608.9449 621.0425 632.3660 681.8511 771.0844 784.6274 811.5133 886.2149 896.6738 965.7033 968.3028 977.5065 985.6327 995.4467 1013.9990 1018.6665 1039.6329 1040.2474 1044.4043 1047.9672 1052.1936 1058.6951 1063.6111 1067.7492 1083.1034 1095.5072 1100.1346 1213.7691 1220.7774 1248.5039 1249.6562 1253.2712 1316.6698 1342.2218 1342.4689 1353.0509 1386.4640 1386.6905 1395.8946 1400.2896 1406.0343 1412.2699 1412.2917 1426.0214 1449.6675 1449.6705 1461.7726 1463.6656 1465.4216 1466.0806 1471.3522 1472.7523 1477.1298 1478.8908 1485.9157 1490.7871 1495.4390 1506.6540 1533.0035 1537.5702 1579.8844 1586.3936 1610.9534 1611.6456 2968.9577 2970.6436 2971.8216 2973.5014 2995.0066 2995.0251 3015.2165 3015.4907 3042.9730 3048.4797 3049.0417 3054.2655 3074.7694 3074.9988 3092.2347 3096.0615 3097.2143 3097.2213 3098.6079 3098.6368 3111.7004 3113.2797 3550.4087 3550.4214
redmass: 3.5805 4.6892 5.3946 3.6817 3.0886 3.1810 1.2647 1.1726 2.2969 2.0304 1.2596 1.2509 1.2933 1.9570 1.4761 6.5021 2.6697 3.9989 3.0551 3.0954 2.4047 3.2726 3.6535 2.7884 2.4187 2.7652 2.9072 4.8056 2.4817 2.7936 3.7800 1.9485 2.3327 2.3162 2.3990 3.2645 3.1592 1.8198 1.7412 3.7112 4.2051 5.0503 4.2010 2.5372 2.7187 2.8001 3.6439 1.8898 1.6704 2.1936 1.4924 1.5171 1.4477 1.4108 1.6786 1.6607 1.6828 1.7206 1.8617 2.4373 3.0110 2.7838 2.8225 1.9345 3.6145 1.1978 1.1497 2.0902 1.9911 3.9585 5.3575 1.4121 1.7749 3.2958 1.2381 1.2355 1.2308 1.2889 1.1857 1.2127 2.9070 5.0058 1.0456 1.0456 1.1281 1.2326 1.1371 1.1046 1.1934 1.0724 1.3799 1.4502 1.3051 1.2171 1.0519 1.0680 1.0782 1.1107 5.3205 6.1076 6.1048 6.1238 1.0436 1.0444 1.0431 1.0443 1.0359 1.0359 1.0657 1.0657 1.0930 1.0913 1.0930 1.0910 1.0959 1.0959 1.0963 1.0960 1.0998 1.0998 1.0989 1.0989 1.0956 1.0953 1.0779 1.0779
irintensity: 2.4633 1.3333 4.7476 9.8387 7.3184 4.4096 6.0875 0.3131 0.0081 2.7813 0.0180 0.2554 0.1114 0.1635 3.8533 2.8163 1.4923 0.2427 21.7872 1.3581 3.9830 0.1390 0.0211 0.5770 0.0167 9.9810 0.0027 0.5366 14.2537 0.8869 0.6771 47.4616 23.1509 64.5418 20.2907 0.2728 17.9567 24.0926 23.7542 0.6556 5.1654 1.7749 0.3501 1.7651 19.4755 17.5719 0.0467 1.2864 1.2046 2.8074 0.6838 1.2811 10.8689 0.0052 1.9770 13.9881 0.1069 22.3616 11.8177 3.5541 11.0608 22.4191 4.5379 1.0268 0.0135 1.5476 39.5460 165.6410 26.2855 50.9522 0.4202 5.7306 1.1257 0.0015 118.4499 9.2876 0.2599 0.1191 24.6717 24.8322 0.8581 7.6610 14.8949 15.8383 11.9138 176.5176 76.2905 4.4105 22.9411 2.6694 35.9973 240.0574 17.5578 113.2395 8.2720 2.9220 23.8695 0.0497 2.9365 3.7457 216.1015 165.2742 69.3637 11.2064 36.5044 4.0441 21.0683 3.5982 42.1932 35.4464 26.5816 32.3042 3.1216 5.3944 9.2733 3.2573 58.9803 1.8460 9.6633 24.5524 8.9466 15.2194 2.2692 0.1893 13.9384 12.1718
temp: 298.150 k
press: 1.00000 atm
elementType: 8 8 7 7 6 6 6 6 6 6 6 6 6 6 6 6 6 6 6 6 1 1 1 1 1 1 1 1 1 1 1 1 1 1 1 1 1 1 1 1 1 1 1 1
symmnumber: 1
zpe: 976793.6 jmol-1
zpe.correction: 0.372041 hartree
zpe.thermalcorrener: 0.395255 hartree
zpe.thermalcorrenthalpy: 0.396199 hartree
zpe.thermalcorrgfe: 0.317468 hartree
zpe.sumelectzpe: -882.566600 hartree
zpe.sumelectthermal: -882.543387 hartree
zpe.sumelectthermalent: -882.542442 hartree
zpe.sumelectthermalfe: -882.621173 hartree
dipole: 0.0004 5.1806 -0.0007
dipole: 5.1806
quadrupole: -135.4585 -119.2137 -121.0624
quadrupole: -0.0038 -27.4324 0.0014
quadrupole: -10.2136 6.0312 4.1824 -0.0038 -27.4324 0.0014
hfenergy: -882.9386414 hartree
pointgroup: C01 [X(C16H24N2O2)]
dipole: 0.0002194 -2.0382108 -0.0025487 debye
polarizability: 256.8206936|0.009368|207.5819693|-1.7561511|0.0737221|139.8993893 unknown
InChI: InChI=1S/C16H24N2O2/c1-9-10(2)16(8-18-14(6)20)12(4)11(3)15(9)7-17-13(5)19/h17-18H,7-8H2,1-6H3
charge 0 multiplicity 1
44 atoms
O  -4.981518 1.551866 0.767334
O  4.980652 1.555672 -0.763276
N  -3.780624 -0.172782 -0.232736
N  3.780332 -0.171906 0.232438
C  -1.364423 -0.330868 0.405753
C  1.364233 -0.32935 -0.406595
C  -0.684679 0.90724 0.201698
C  0.68393 0.907995 -0.199824
C  -0.686923 -1.568047 0.190923
C  0.687276 -1.567312 -0.194535
C  -2.816795 -0.326554 0.880749
C  2.816635 -0.323323 -0.881493
C  -1.389816 2.24286 0.396447
C  1.388451 2.244346 -0.391687
C  -1.400934 -2.907907 0.347868
C  1.401844 -2.906536 -0.354418
C  -4.801746 0.764433 -0.214194
C  4.801041 0.765805 0.216324
C  -5.694368 0.792323 -1.45223
C  5.69362 0.790922 1.45445
H  -3.047152 -1.250494 1.440324
H  -3.021712 0.508883 1.569736
H  3.047365 -1.245817 -1.443285
H  3.021293 0.513874 -1.568418
H  -1.028822 2.755409 1.31057
H  -1.178664 2.925184 -0.446979
H  -2.482289 2.154085 0.48216
H  2.480971 2.156262 -0.477545
H  1.027269 2.758676 -1.304735
H  1.176941 2.924767 0.453184
H  -1.106504 -3.610252 -0.451795
H  -1.151787 -3.397214 1.310987
H  -2.497549 -2.814471 0.30686
H  1.152697 -3.393938 -1.318501
H  2.498428 -2.81274 -0.313435
H  1.107856 -3.610663 0.443845
H  -3.645449 -0.751049 -1.063762
H  3.645302 -0.752233 1.062052
H  -6.736505 0.592848 -1.148192
H  -5.670981 1.805116 -1.889895
H  -5.401651 0.060869 -2.225519
H  6.735781 0.592205 1.149988
H  5.670145 1.802722 1.894393
H  5.400929 0.057697 2.226066
