program: Gaussian 09
title: 000278640
version: EM64L-G09RevD.01
frameworkgroup: C1[X(C4H8N2O4)]
method: RPBEPBE
basis: SDD
operation: Freq
keyword: #pfreq=noraman
keyword: PBEPBE/SDD
title: #p freq=noraman PBEPBE/SDD
converged: YES YES NO NO
title: Mulliken charges:
elementType: O O O O N N C C C C H H H H H H H H
charge: -0.294308 -0.402195 -0.241514 -0.282406 -0.581688 -0.617468 -0.226920 -0.302893 0.195035 0.319554 0.301260 0.265861 0.234897 0.292066 0.288638 0.374111 0.337602 0.340366
chargesum: 0.00000
title: Mulliken charges with hydrogens summed into heavy atoms:
elementType: O O O O N N C C C C
charge: -0.294308 -0.028084 -0.241514 -0.282406 -0.000983 0.060501 0.074341 0.197866 0.195035 0.319554
polarizability: 7.84655221e+01 -9.97688941e+00 7.04800765e+01 7.29354169e+00 3.81951807e+00 5.91723426e+01
1716.lowfreq: -12.3676 -10.5373 -0.0005 -0.0004 -0.0002 6.9414 35.7001 44.6428 64.6061
frequency: 35.6632 44.5994 64.5988 92.6582 165.8771 232.1584 247.6355 292.5142 296.4018 353.2161 433.9729 495.1870 503.3311 519.4269 592.3819 605.4897 631.0040 642.9542 705.7465 729.7591 762.2584 788.4307 978.0246 1003.9760 1035.8167 1050.4605 1060.3084 1122.5742 1189.1243 1225.3886 1256.9013 1303.9085 1317.7288 1358.1948 1391.4071 1440.8325 1587.8752 1638.5937 1656.0222 1692.3573 3044.2534 3084.4036 3128.6588 3471.1410 3488.9691 3559.2758 3606.6325 3717.3409
redmass: 9.0576 7.4763 5.4536 4.4428 7.2235 1.9853 2.4675 2.0328 2.8336 3.6431 4.2657 1.5190 2.2044 1.0621 2.5878 1.4521 2.3609 2.0047 10.9775 4.3347 3.4028 3.8913 2.0691 3.1374 4.6797 2.1568 2.0006 3.2730 1.6589 1.3041 1.4231 2.2752 1.4717 1.4878 1.4691 1.1030 1.2097 1.2345 4.4296 7.3495 1.0568 1.0872 1.1098 1.0456 1.0638 1.0445 1.0982 1.1058
irintensity: 2.2184 1.2077 9.2054 2.6630 5.3644 17.5901 12.9331 28.4857 18.7408 3.8294 23.9130 153.6368 153.1841 39.3988 22.5467 122.6555 210.1517 82.6662 51.2820 10.5967 0.1980 22.6405 15.5209 61.1450 129.3642 151.0527 55.8532 27.8711 16.7919 20.8598 14.9942 291.5721 18.4743 77.6211 2.5043 34.7081 93.9184 111.0865 141.3105 361.1855 20.2999 2.0939 6.1299 3.6425 11.0171 64.6716 10.6981 51.1889
temp: 298.150 k
press: 1.00000 atm
elementType: 8 8 8 8 7 7 6 6 6 6 1 1 1 1 1 1 1 1
symmnumber: 1
zpe: 356758.9 jmol-1
zpe.correction: 0.135882 hartree
zpe.thermalcorrener: 0.147025 hartree
zpe.thermalcorrenthalpy: 0.147969 hartree
zpe.thermalcorrgfe: 0.097802 hartree
zpe.sumelectzpe: -566.847587 hartree
zpe.sumelectthermal: -566.836444 hartree
zpe.sumelectthermalent: -566.835500 hartree
zpe.sumelectthermalfe: -566.885667 hartree
dipole: -0.6902 2.3974 0.1106
dipole: 2.4973
quadrupole: -50.2038 -54.6680 -60.2386
quadrupole: -10.5944 -8.1165 -2.8164
quadrupole: 4.8330 0.3688 -5.2018 -10.5944 -8.1165 -2.8164
hfenergy: -566.9834692 hartree
pointgroup: C01 [X(C4H8N2O4)]
dipole: -0.1735148 -0.9636066 -0.0815459 debye
dipolederiv: -1.2355732 -0.3455103 0.3101213 -0.375273 -0.5160166 0.0338498 0.5658628 0.1657426 -0.7388145 -0.425476 -0.1638843 0.0838735 -0.2432289 -0.7772136 0.4800107 0.0973715 0.4022966 -0.6184572 -0.6174503 0.0100671 0.326645 0.1777459 -0.6206347 -0.0922737 0.3136495 0.074637 -0.6962792 -0.6116864 -0.097025 0.0875587 -0.1006404 -0.66289 -0.3026425 0.1291771 -0.2909014 -0.839028 -0.5844784 0.0535519 -0.0420132 -0.0324708 -0.860565 -0.0162573 -0.0530843 0.0463952 -0.188696 -1.0029326 -0.303621 -0.2101799 -0.3655685 -0.9766193 0.0227967 -0.1890638 0.0446526 -0.3835014 0.2752993 0.1979281 0.0561334 0.1395248 0.2461684 0.083654 0.0431727 0.0384567 0.0720951 0.7480634 0.1422538 -0.0442289 0.3994816 0.3700983 -0.1061 0.0421334 -0.0809608 0.2423662 0.6202953 0.0040756 -0.5538659 -0.1789177 1.1166783 -0.2872157 -0.6037502 -0.3757914 0.913309 1.5686982 0.6922149 -0.3273042 0.6860789 1.2155973 0.3986308 -0.6455471 0.233477 1.2743699 0.1113973 -0.0084907 0.0346257 -0.0112534 0.0525006 0.0108935 0.0315354 0.0139011 -0.0228716 -0.0172619 0.0678756 0.0106491 0.010736 -0.0423829 0.0001647 -0.0295641 -0.0529007 0.0936586 0.0014016 -0.049532 0.0677409 -0.030604 0.0771085 0.0017822 0.0324961 0.0436945 -0.0654529 0.1571149 -0.0831873 0.0599396 -0.0071652 0.3410326 -0.1079293 0.0635494 -0.0567257 0.1287643 0.1013307 -0.105383 -0.0737223 -0.0059356 0.319834 0.0722921 -0.0504731 0.026542 0.1033729 0.299962 0.1121462 0.0868272 0.0812411 0.1627458 -0.063449 0.1201915 -0.1021127 0.2823443 0.3021919 -0.0701393 0.0640868 -0.0619796 0.2804824 -0.065443 0.0919309 -0.0472732 0.2232155 0.3091043 -0.0533406 0.063113 -0.0817712 0.2740759 -0.062764 0.0404124 -0.0831294 0.2196052 unknown
polarizability: 74.0655702|11.4639531|72.43963|-8.86354|2.3434372|61.612741 unknown
InChI: InChI=1S/C4H8N2O4/c5-2(3(7)8)1-10-4(6)9/h2,7H,1,5-6H2
charge 0 multiplicity 1
18 atoms
O  -1.105388 -0.048276 -0.694664
O  1.198257 -1.70711 0.810955
O  2.436522 -0.885231 -0.975238
O  -1.976903 0.600972 1.40263
N  2.061909 1.756769 0.261273
N  -2.859234 -1.200153 0.17782
C  1.063955 0.686487 0.361508
C  -0.111058 1.041844 -0.589157
C  1.644189 -0.682921 -0.02693
C  -1.991713 -0.155943 0.400683
H  0.670509 0.631439 1.388616
H  -0.5867 1.961885 -0.212882
H  0.251594 1.179111 -1.620488
H  2.6517 1.693573 -0.575058
H  2.595035 1.93188 1.115574
H  1.577724 -2.577881 0.507923
H  -2.791246 -1.753526 -0.672639
H  -3.559649 -1.411119 0.882575
