program: Gaussian 09
title: 000278628
version: EM64L-G09RevD.01
frameworkgroup: C1[X(C12H7ClO)]
method: RPBEPBE
basis: SDD
operation: Freq
keyword: #p
keyword: freq=noraman
keyword: PBEPBE/SDD
title: #p freq=noraman PBEPBE/SDD
converged: YES YES NO NO
title: Mulliken charges:
elementType: Cl O C C C C C C C C C C C C H H H H H H H
charge: -0.035818 -0.154788 -0.119749 0.483567 -0.691029 0.239719 0.492497 0.042130 -0.410983 -0.391418 -0.423555 -0.412332 -0.211800 -0.209131 0.312339 0.261370 0.273718 0.245014 0.245542 0.230518 0.234187
chargesum: 0.00000
title: Mulliken charges with hydrogens summed into heavy atoms:
elementType: Cl O C C C C C C C C C C C C
charge: -0.035818 -0.154788 -0.119749 0.483567 -0.378690 0.239719 0.492497 0.042130 -0.149612 -0.117700 -0.178541 -0.166790 0.018719 0.025056
polarizability: 1.79827565e+02 -6.95102553e-01 1.75864366e+02 8.60438453e+00 -4.07633441e+00 6.67025160e+01
1716.lowfreq: -7.2327 -4.0946 0.0006 0.0021 0.0027 9.2573 46.8865 116.6399 157.9959
frequency: 46.8678 116.6384 157.9955 169.7956 215.7871 273.8921 289.6724 397.3311 433.9142 462.9285 466.8219 497.2099 534.5829 564.8349 586.8970 623.2874 652.0752 690.0378 748.5789 783.8916 793.7639 803.5928 808.0184 855.8942 922.4667 943.8388 953.1397 987.7170 998.8828 1001.7723 1022.5030 1049.5230 1112.8845 1153.2831 1171.9792 1183.5727 1189.1247 1235.0641 1247.9468 1268.6029 1366.8525 1395.0455 1420.4741 1460.7319 1466.7585 1497.7854 1601.6323 1609.7570 1632.2782 1648.2787 3091.3913 3131.0060 3131.6827 3148.0285 3150.5827 3165.0002 3167.7680
redmass: 10.3613 7.7873 11.8747 4.0294 4.5527 7.4993 6.7536 5.0417 4.5950 3.4967 5.8703 6.5207 7.2173 7.0484 4.1837 3.4373 5.3881 7.1169 1.7694 2.3892 5.1966 2.4220 2.7979 2.7043 1.4177 1.4649 6.9950 1.3630 1.4057 4.1091 2.8296 1.9602 2.5656 1.1586 1.1964 1.2742 1.2419 1.7070 2.5947 2.3726 2.7164 4.7827 1.8868 3.7300 5.2920 4.1583 6.9431 7.8225 8.2150 11.7517 1.0872 1.0875 1.0869 1.0928 1.0924 1.0982 1.0978
irintensity: 0.8854 0.7109 1.2215 4.4079 0.4494 1.3984 5.3925 1.3453 3.1699 0.7856 12.0397 6.5006 14.1189 3.0241 0.6438 0.7873 0.3476 50.0427 3.9090 61.1493 0.0213 14.2444 15.4079 52.1354 0.9608 0.2456 6.6757 0.4153 2.7845 44.0409 4.6509 1.9923 1.1994 4.1517 2.1492 0.0908 14.8259 4.1794 28.8322 27.1533 3.7923 7.8675 0.6316 21.1953 3.8283 12.0419 33.2315 18.0539 28.9644 200.3244 3.3257 1.5121 1.1539 12.6128 14.1214 22.8144 15.4179
temp: 298.150 k
press: 1.00000 atm
elementType: 17 8 6 6 6 6 6 6 6 6 6 6 6 6 1 1 1 1 1 1 1
symmnumber: 1
zpe: 397768.3 jmol-1
zpe.correction: 0.151502 hartree
zpe.thermalcorrener: 0.161787 hartree
zpe.thermalcorrenthalpy: 0.162731 hartree
zpe.thermalcorrgfe: 0.114808 hartree
zpe.sumelectzpe: -995.829241 hartree
zpe.sumelectthermal: -995.818955 hartree
zpe.sumelectthermalent: -995.818011 hartree
zpe.sumelectthermalfe: -995.865934 hartree
dipole: 4.9582 2.2448 -0.6595
dipole: 5.4825
quadrupole: -85.4966 -80.7283 -89.0100
quadrupole: -6.9815 4.1643 -3.6933
quadrupole: -0.4183 4.3500 -3.9317 -6.9815 4.1643 -3.6933
hfenergy: -995.9807425 hartree
pointgroup: C01 [X(C12H7Cl1O1)]
dipole: 2.1068774 0.2864755 -0.3626516 debye
dipolederiv: -0.464163 0.1094821 0.1292265 0.153819 -0.2337709 -0.0966294 0.3169338 -0.120431 -0.3243028 -1.0210896 -0.257443 -0.1344178 -0.3391847 -0.5661066 -0.0965974 -0.1182533 -0.0363322 -0.3028785 -0.0993679 -0.1008323 0.0250762 0.1582828 -0.0152033 0.0262889 0.0161877 -0.014906 -0.0231836 -0.0086411 -0.0034403 0.0122223 -0.0214655 -0.0472676 -0.0343929 -0.0025779 -0.013302 -0.0992673 0.6387881 -0.1457777 -0.1912913 -0.0634031 -0.095702 0.0682726 -0.3383307 0.1443517 0.4891649 -0.7485746 0.0803124 -0.0887826 0.2616993 -0.0943345 0.0213195 -0.1227217 0.0199171 0.0276029 -0.1532542 0.1236477 -0.0317171 0.0542793 0.0640605 0.0054098 -0.0470888 0.0179538 0.0909909 1.5230806 0.1971618 0.2273494 -0.0757356 0.8534925 0.1275917 0.2573591 0.0024556 0.0877423 0.0217891 -0.1533407 0.0312733 -0.0865727 0.009183 -0.0267814 -0.0058351 -0.0131874 -0.1244795 0.1946721 0.1658654 0.0312569 -0.0912488 0.0152653 -0.0203638 0.0346943 0.01308 -0.1111015 0.1272323 0.0728601 0.0334988 -0.0119781 -0.0327937 -0.0022201 0.0323121 -0.0036451 -0.1714032 0.1661955 -0.0680938 0.0372727 0.0893915 0.078036 -0.0006742 0.0260364 -0.02328 -0.1492419 0.0168997 0.1423256 0.0177701 0.1477786 0.0208285 -0.0086551 0.0026969 0.0101693 -0.1359908 -0.1741161 -0.1913753 0.0073347 -0.228356 0.0153995 -0.0388303 0.0139753 -0.0340217 -0.1459087 -0.0156224 0.0223739 -0.016158 0.0362954 0.0451247 0.0080321 0.0149516 -0.0020686 -0.0287934 0.0521105 0.0795184 -0.0174373 0.0602232 -0.0257515 0.0192317 -0.0046029 0.0113313 0.1464274 0.0610802 -0.0751161 -0.006643 -0.0458567 -0.001394 0.0053878 -0.0067873 0.0017374 0.1578575 -0.0973219 -0.0327399 -0.0219468 0.0255031 0.0787492 0.0074622 -0.0251586 0.0027069 0.1549823 -0.0898642 0.0422552 -0.0259445 -0.0115053 0.0811626 0.0034237 -0.0225016 0.0091094 0.1505223 0.0296144 -0.0896015 -0.0017564 -0.1025663 -0.0706294 0.008915 -0.003532 0.0053421 0.1558457 0.0405526 0.0819577 -0.0161864 0.0906006 -0.0783483 0.0238095 -0.0177573 0.0230193 0.155415 unknown
polarizability: 179.5230746|-2.0767974|176.9497928|0.7242674|-1.1469053|65.9215796 unknown
InChI: InChI=1S/C12H7ClO/c13-11-8-5-1-3-7-4-2-6-9(10(7)8)12(11)14/h1-6,11H
charge 0 multiplicity 1
21 atoms
Cl -2.90009 1.530261 1.095357
O  -2.925961 -1.440645 -0.429955
C  0.329151 -0.003498 -0.072125
C  -0.414195 1.204735 -0.236101
C  -1.873609 0.841985 -0.358743
C  -0.491588 -1.169337 -0.083763
C  1.746717 -0.047402 0.07367
C  -1.90127 -0.731389 -0.29505
C  0.271332 2.418733 -0.255082
C  0.090458 -2.433129 0.062248
C  2.430645 1.214828 0.050663
C  2.324602 -1.353161 0.224577
C  1.702547 2.404203 -0.111092
C  1.513116 -2.504165 0.219277
H  -2.399188 1.229829 -1.244251
H  -0.256043 3.371869 -0.363376
H  -0.520275 -3.341464 0.055927
H  3.520788 1.248777 0.159085
H  3.409756 -1.454927 0.344257
H  2.238645 3.359542 -0.126081
H  1.983361 -3.486543 0.33686
