program: Gaussian 09
title: 000278620
version: EM64L-G09RevD.01
frameworkgroup: C1[X(C19H14O3)]
method: RPBEPBE
basis: SDD
operation: Freq
keyword: #pfreq=noraman
keyword: PBEPBE/SDD
title: #p freq=noraman PBEPBE/SDD
converged: YES YES NO NO
title: Mulliken charges:
elementType: O O O C C C C C C C C C C C C C C C C C C C H H H H H H H H H H H H H H
charge: -0.289483 -0.430616 -0.261312 -0.224334 -0.271530 -0.218113 0.378732 0.255855 0.506223 -0.413386 -0.412480 -0.437429 -0.432782 -0.218518 -0.214925 0.213441 0.216324 -0.340558 -0.338560 -0.221301 -0.218608 -0.221657 0.279868 0.267646 0.278487 0.258720 0.240380 0.240634 0.226260 0.225810 0.340449 0.269232 0.268530 0.233866 0.232120 0.233012
chargesum: 0.00000
title: Mulliken charges with hydrogens summed into heavy atoms:
elementType: O O O C C C C C C C C C C C C C C C C C C C
charge: -0.289483 -0.090167 -0.261312 0.055535 -0.003885 -0.218113 0.378732 0.255855 0.506223 -0.134899 -0.153759 -0.197049 -0.192148 0.007743 0.010885 0.213441 0.216324 -0.071326 -0.070030 0.012565 0.013513 0.011354
polarizability: 2.83647793e+02 -1.64490300e+01 2.10414410e+02 -1.81429936e+01 2.13424596e+01 1.50506362e+02
1716.lowfreq: -6.6729 -0.0009 -0.0007 -0.0003 1.9920 4.4409 20.1512 23.1427 36.0363
frequency: 20.0895 22.8570 35.9885 67.4792 79.5563 129.8800 155.0483 166.3111 195.7499 209.1964 219.8499 270.9733 291.9734 333.5422 353.8957 397.2677 403.7170 420.2475 440.6847 465.7244 469.3444 497.8159 526.0688 535.6199 561.1133 599.9148 614.2633 624.1007 665.9709 675.8788 679.5961 699.6983 709.8269 776.0179 785.4107 794.0250 795.4227 803.1820 819.3043 864.0737 866.3446 900.2864 918.9362 935.4860 953.5953 954.4049 982.3062 990.5260 991.9250 995.6789 1001.4929 1008.7489 1009.7273 1018.4383 1024.5644 1047.3763 1051.3990 1086.6785 1098.2869 1164.1720 1173.5928 1174.3037 1182.0146 1187.7852 1207.1710 1227.6522 1238.0049 1242.5365 1262.0427 1265.7679 1314.7097 1318.9530 1357.5685 1373.5091 1390.1064 1393.8524 1417.1014 1438.3844 1466.3422 1469.5281 1477.8553 1501.1893 1582.8996 1605.8749 1610.5106 1611.0439 1615.7179 1632.6161 3047.6735 3071.0669 3125.8112 3126.5607 3130.6190 3142.6478 3143.3900 3147.8325 3155.6936 3159.7678 3167.1217 3167.5011 3179.8879 3545.8994
redmass: 5.5920 4.3823 5.4818 7.6843 6.1435 5.7094 5.0499 4.1929 6.4057 4.5356 5.7864 3.9767 6.5946 1.2666 4.8962 6.0461 2.8173 4.1740 3.7479 3.2577 5.8304 6.7045 5.5103 4.2529 5.9575 5.6267 6.4249 3.6054 5.5404 5.7035 4.9164 1.6918 3.3659 1.5255 2.5148 2.2144 4.9229 4.6625 2.0366 1.2696 3.8359 3.1827 1.8210 1.5006 2.1515 2.2149 1.3548 6.2374 1.3733 1.3883 3.0162 1.3342 4.2639 3.1790 2.7656 1.8931 2.8642 1.6983 2.6550 1.2810 1.2063 1.0577 1.1268 1.2462 1.4074 1.3414 2.2330 2.0672 2.2500 2.0540 1.3505 1.3868 1.1752 2.7577 10.0620 4.8680 1.8589 2.2468 3.0597 7.1188 2.2937 4.5471 7.1142 6.6001 7.5123 7.1464 8.9353 7.8871 1.0854 1.0855 1.0864 1.0866 1.0855 1.0925 1.0891 1.0939 1.0939 1.0981 1.0968 1.0981 1.0976 1.0663
irintensity: 0.4817 0.7347 0.7010 1.6531 0.8472 0.4464 1.2129 3.2309 3.3070 0.5527 1.8087 2.4271 14.2941 114.8725 7.3012 0.8892 0.0108 2.5007 0.8523 0.2001 3.5406 0.9662 1.6831 18.1075 1.2444 6.2424 1.0231 2.2727 2.4374 7.2033 12.7748 72.4294 23.9600 0.4503 18.3407 31.8485 0.8971 22.2440 119.7432 0.2995 11.9491 42.8932 17.2162 8.0707 21.8488 48.7955 0.7612 1.5079 3.9188 0.0837 2.3071 0.0966 21.9026 130.9411 15.8746 1.7454 250.6864 27.2602 4.5916 19.0860 1.6250 0.4203 57.6233 18.7390 3.6812 30.1518 200.8659 142.7692 20.7174 30.8667 5.9887 9.7875 44.3184 16.7798 2.8825 0.4677 0.0714 17.4356 1.8640 4.9228 6.3962 7.2331 52.5664 3.9450 10.0410 10.3794 122.2314 1.7497 6.8795 10.7694 1.5894 1.8488 0.2495 15.2082 10.3941 26.6120 16.1909 30.7097 9.1906 23.7589 8.2549 9.5729
temp: 298.150 k
press: 1.00000 atm
elementType: 8 8 8 6 6 6 6 6 6 6 6 6 6 6 6 6 6 6 6 6 6 6 1 1 1 1 1 1 1 1 1 1 1 1 1 1
symmnumber: 1
zpe: 725099.4 jmol-1
zpe.correction: 0.276176 hartree
zpe.thermalcorrener: 0.293547 hartree
zpe.thermalcorrenthalpy: 0.294491 hartree
zpe.thermalcorrgfe: 0.228881 hartree
zpe.sumelectzpe: -956.597669 hartree
zpe.sumelectthermal: -956.580298 hartree
zpe.sumelectthermalent: -956.579354 hartree
zpe.sumelectthermalfe: -956.644964 hartree
dipole: 0.7399 0.7090 -2.2723
dipole: 2.4927
quadrupole: -98.6824 -124.1264 -127.6572
quadrupole: 0.8995 3.4021 4.4176
quadrupole: 18.1396 -7.3044 -10.8352 0.8995 3.4021 4.4176
hfenergy: -956.8738448 hartree
pointgroup: C01 [X(C19H14O3)]
dipole: -0.3324415 0.6877017 0.615068 debye
polarizability: 281.0634299|12.06198|175.3964274|-23.5577221|-38.3834514|188.1087081 unknown
InChI: InChI=1S/C19H14O3/c20-17-14-10-4-8-12-9-5-11-15(16(12)14)18(17)22-19(21)13-6-2-1-3-7-13/h1-11,17-18,20H
charge 0 multiplicity 1
36 atoms
O  0.977846 -0.577681 0.002903
O  -1.270168 -3.303154 -0.203985
O  1.805531 -0.013374 -2.104187
C  -0.31629 -0.986614 -0.64169
C  -1.02717 -1.966769 0.366643
C  -2.385458 -0.013883 0.048112
C  -1.262611 0.195133 -0.804038
C  -2.310749 -1.241158 0.766045
C  -3.476104 0.900295 0.15722
C  -1.208913 1.346518 -1.590359
C  -3.349343 -1.58908 1.629978
C  -3.395332 2.084507 -0.650349
C  -4.53223 0.525477 1.055231
C  -2.29113 2.289336 -1.493505
C  -4.461103 -0.68537 1.763096
C  1.976645 -0.116127 -0.862196
C  3.23368 0.225896 -0.137055
C  4.338487 0.683706 -0.901807
C  3.347589 0.107656 1.27283
C  5.548541 1.019179 -0.261433
C  4.560588 0.445636 1.908795
C  5.661754 0.900741 1.144785
H  -0.064161 -1.485227 -1.594323
H  -0.351593 -2.166637 1.213872
H  -0.367529 1.535642 -2.263868
H  -3.333626 -2.526171 2.196463
H  -4.200761 2.827379 -0.610457
H  -5.397556 1.186196 1.18479
H  -2.249171 3.196849 -2.106496
H  -5.277549 -0.955732 2.442434
H  -2.030532 -3.24451 -0.838286
H  4.226347 0.766242 -1.987937
H  2.48936 -0.244495 1.851455
H  6.400666 1.37103 -0.852766
H  4.64933 0.355238 2.996778
H  6.602613 1.161725 1.642308
