program: Gaussian 09
title: 000278714
version: EM64L-G09RevD.01
frameworkgroup: C1[X(C28H21NO4)]
method: RPBEPBE
basis: SDD
operation: Freq
keyword: #p
keyword: freq=noraman
keyword: PBEPBE/SDD
title: #p freq=noraman PBEPBE/SDD
converged: YES YES NO NO
title: Mulliken charges:
elementType: O O O O N C C C C C C C C C C C C C C C C C C C C C C C C C C C C H H H H H H H H H H H H H H H H H H H H H
charge: -0.377335 -0.223536 -0.443337 -0.262742 -0.470277 -0.696144 0.313699 0.261722 0.278691 0.152454 -0.527782 -0.563842 0.382542 0.143856 -0.427700 -0.381744 -0.235611 -0.240405 0.018702 0.162051 0.239994 0.241583 -0.365296 -0.389992 -0.524527 0.142000 -0.383482 -0.236811 -0.238365 -0.343081 -0.232878 -0.233020 0.010226 0.242373 0.245116 0.309155 0.247893 0.239742 0.248535 0.224741 0.226999 0.372983 0.247413 0.249516 0.239069 0.258020 0.225257 0.255036 0.230002 0.229113 0.272090 0.231816 0.233881 0.421637
chargesum: 0.00000
title: Mulliken charges with hydrogens summed into heavy atoms:
elementType: O O O O N C C C C C C C C C C C C C C C C C C C C C C C C C C C C
charge: -0.377335 -0.223536 -0.021701 -0.262742 -0.097294 -0.208654 0.313699 0.261722 0.278691 0.152454 -0.218626 -0.315949 0.382542 0.143856 -0.187959 -0.133209 -0.010870 -0.013406 0.018702 0.162051 0.239994 0.241583 -0.117883 -0.140476 0.197819 0.142000 -0.128446 -0.006809 -0.009252 -0.070991 -0.001062 0.000861 0.010226
polarizability: 4.42744497e+02 -7.74938550e-01 3.10173039e+02 -3.26833370e+01 -3.04795077e+00 2.75007377e+02
1716.lowfreq: -0.0005 0.0000 0.0005 1.8452 4.6961 5.4653 16.6151 39.9074 41.9514
frequency: 16.6010 39.9059 41.9453 55.1480 59.8335 70.1164 76.8835 85.4352 103.6251 106.9131 120.5344 126.7395 149.1152 155.1268 171.1733 185.0021 192.2647 214.9069 231.3961 232.9567 246.8413 256.4444 282.9448 294.1599 320.6601 337.5296 362.4802 380.4485 395.4346 401.0831 408.2191 432.9428 434.6825 455.5774 490.4585 507.9096 511.4984 539.7867 553.6218 562.7956 568.0185 579.1987 615.5595 619.7869 624.1840 649.2864 657.3935 680.7527 695.9503 709.5946 718.2331 720.9573 735.5103 743.2357 751.6304 766.6527 769.4387 774.4486 776.0606 780.9576 788.4483 812.2059 823.6070 833.8780 847.7215 872.9719 876.0526 886.9384 893.4106 912.5598 932.8968 935.5807 951.2310 965.1340 968.2283 986.2907 987.4408 993.7837 998.2527 1000.0005 1023.0597 1027.6072 1038.4926 1051.2989 1071.9694 1095.2681 1110.1943 1117.9540 1124.1998 1130.7503 1132.2568 1159.0741 1168.7990 1174.9771 1176.4271 1177.6722 1182.3369 1200.6392 1207.9348 1223.0913 1238.2807 1253.5574 1265.8592 1277.8580 1280.8417 1286.5979 1321.8928 1358.7766 1361.9452 1370.8879 1374.1720 1392.3658 1420.6074 1424.1901 1426.6224 1430.5238 1440.8325 1450.6717 1463.2564 1467.5303 1473.9009 1481.1676 1482.5904 1492.3403 1496.0228 1571.4466 1579.0909 1590.0996 1591.7282 1595.9359 1603.0819 1604.6716 1622.0297 1624.2508 1627.8330 2978.3781 2979.4721 3021.7126 3078.1240 3121.6095 3124.6814 3130.8997 3131.1237 3131.3800 3132.3517 3143.8902 3145.1633 3146.4871 3146.8416 3159.8909 3161.8363 3163.8843 3174.9135 3179.1057 3188.9095 3450.3121
redmass: 6.0753 4.6958 5.5617 4.9389 6.0220 4.5572 4.1637 5.2240 6.8780 5.6076 4.9943 6.6125 5.4172 5.6062 3.7811 4.9324 2.0350 3.6860 3.1423 2.4106 4.2862 5.9683 5.6008 4.0187 5.4661 5.5494 5.4462 5.2107 5.1347 4.1936 4.1010 2.9389 4.2993 4.3152 5.3534 4.0720 3.9186 4.0094 4.5573 3.9503 5.4284 4.6783 6.8195 6.0635 5.9391 4.8480 5.9803 4.1328 5.3666 5.5968 5.2091 3.5668 1.9619 2.6710 2.3999 1.4561 2.3972 1.8336 1.9806 3.3229 2.1470 4.8934 1.5792 2.6415 1.4142 1.3417 1.6050 2.7374 1.4505 1.6641 6.0123 1.6728 1.4189 1.8092 1.3995 1.3270 1.3291 5.9437 1.4027 5.1979 2.1775 6.2164 3.0013 2.5085 2.6379 2.2709 2.0588 1.3609 1.8020 1.5668 1.1426 1.4299 1.2218 1.6932 1.4178 1.0788 1.8451 1.6059 2.1936 2.7451 1.7948 1.5382 2.0282 1.5029 1.9325 2.0127 2.5210 2.0014 9.0220 7.2825 5.0515 4.6468 2.3350 2.1661 2.1815 1.2438 1.3491 2.6311 1.1175 2.3741 1.5934 3.4614 1.4580 3.1665 3.0681 6.8022 6.9284 9.0327 6.7762 5.2469 5.9527 5.8568 7.3768 6.6463 7.3527 1.0601 1.0319 1.0994 1.1042 1.0859 1.0852 1.0891 1.1023 1.0872 1.0881 1.0947 1.0932 1.0919 1.0914 1.0959 1.1003 1.1009 1.0983 1.0667 1.0930 1.0775
irintensity: 0.1192 0.7994 0.1282 0.7267 5.1178 1.5783 0.6474 0.6701 2.2201 2.4135 4.1622 8.1594 5.5203 0.5274 0.4286 5.8827 1.1599 1.0512 6.1085 1.9140 16.9008 0.9816 2.1311 0.1462 0.9697 2.5720 5.3229 2.3376 1.8888 5.5738 1.4637 1.9780 6.3692 3.4828 18.5837 5.4436 10.4089 6.7983 12.2098 9.5829 2.3754 29.5639 4.5817 19.9392 5.2517 4.2042 4.3868 3.2210 2.1628 5.5335 4.8058 24.2683 30.8742 92.2903 47.5632 169.5018 23.1477 42.1869 55.4437 28.7768 43.1252 0.5230 121.2650 50.8290 7.3660 2.3991 6.6877 31.8289 1.3661 15.4454 24.5333 4.1654 2.1034 11.8093 4.5962 0.0545 0.0324 9.1347 0.0288 65.1788 28.0223 94.3352 5.0203 47.0316 12.7063 5.1111 27.7786 13.4769 47.9877 7.3985 0.1473 12.0248 4.7255 7.5942 5.1451 1.5365 3.2450 20.8570 165.6950 1.9693 46.2922 0.6395 78.8398 10.9136 67.2718 0.1675 51.4054 5.7847 0.5541 10.2860 52.9869 15.9715 75.6384 9.0951 4.2493 15.0073 33.7019 57.5549 28.9057 30.9426 48.0037 192.7591 30.2431 76.0911 288.9053 17.8187 3.0982 53.2071 21.8922 23.5703 21.1553 16.4487 14.1463 131.9717 87.9314 13.8594 76.0291 8.1208 30.9559 4.8366 1.6817 5.3319 22.1077 2.6286 4.0746 29.3786 26.2760 5.8541 11.3601 27.3038 42.8378 40.0194 34.8941 745.6645 1.2516 53.4936
temp: 298.150 k
press: 1.00000 atm
elementType: 8 8 8 8 7 6 6 6 6 6 6 6 6 6 6 6 6 6 6 6 6 6 6 6 6 6 6 6 6 6 6 6 6 1 1 1 1 1 1 1 1 1 1 1 1 1 1 1 1 1 1 1 1 1
symmnumber: 1
zpe: 1088859.3 jmol-1
zpe.correction: 0.414725 hartree
zpe.thermalcorrener: 0.441928 hartree
zpe.thermalcorrenthalpy: 0.442872 hartree
zpe.thermalcorrgfe: 0.356884 hartree
zpe.sumelectzpe: -1433.006084 hartree
zpe.sumelectthermal: -1432.978881 hartree
zpe.sumelectthermalent: -1432.977936 hartree
zpe.sumelectthermalfe: -1433.063925 hartree
dipole: -1.6987 3.8408 0.0848
dipole: 4.2005
quadrupole: -167.3448 -169.8027 -179.2558
quadrupole: -17.0842 -2.2640 -2.6851
quadrupole: 4.7896 2.3318 -7.1214 -17.0842 -2.2640 -2.6851
hfenergy: -1433.4208083 hartree
pointgroup: C01 [X(C28H21N1O4)]
dipole: -0.5615675 1.4660541 0.5162028 debye
polarizability: 444.9508517|-1.5513759|307.4981324|-25.8855515|11.1120821|275.4759282 unknown
InChI: InChI=1S/C28H21NO4/c1-33-26-15-18-14-17-8-2-3-9-19(17)24(18)16-25(26)29-27(30)22-12-6-4-10-20(22)21-11-5-7-13-23(21)28(31)32/h2-13,15-16,29,31H,14H2,1H3
charge 0 multiplicity 1
54 atoms
O  -0.045942 2.815217 0.888132
O  0.577746 -1.549049 -1.24736
O  1.390399 1.020306 2.367825
O  2.980055 1.611031 0.791657
N  0.522105 0.748042 -0.738498
C  -5.010934 1.51555 0.674519
C  -3.51094 1.453885 0.412908
C  -3.191685 0.295461 -0.354011
C  -5.525807 0.259776 -0.023847
C  -4.438047 -0.446268 -0.623364
C  -1.864743 0.015619 -0.740092
C  -2.494251 2.331657 0.827218
C  -0.834011 0.904331 -0.347912
C  -1.164583 2.040204 0.45818
C  -6.838596 -0.231298 -0.126195
C  -4.66394 -1.649648 -1.327107
C  -7.065932 -1.438869 -0.834584
C  -5.986583 -2.140198 -1.42839
C  1.154856 -0.423957 -1.161333
C  2.599525 -0.227409 -1.584151
C  3.695043 -0.723635 -0.818506
C  3.530773 -1.347601 0.53524
C  2.832176 0.378648 -2.841546
C  4.999092 -0.628526 -1.367046
C  -0.271506 4.231381 1.222416
C  2.920381 -0.687161 1.647919
C  3.986585 -2.678346 0.720594
C  4.139078 0.478557 -3.367727
C  5.225945 -0.036103 -2.628201
C  2.746723 -1.370213 2.879198
C  3.841744 -3.342382 1.957051
C  3.212073 -2.689472 3.04164
C  2.478914 0.734977 1.547544
H  -5.467703 2.435154 0.257669
H  -5.24471 1.509064 1.757655
H  -1.603995 -0.870645 -1.320971
H  -2.724239 3.209946 1.438725
H  -7.67787 0.304546 0.33259
H  -3.833019 -2.198701 -1.783892
H  -8.083778 -1.835052 -0.923297
H  -6.180029 -3.072923 -1.969948
H  1.132831 1.559688 -0.579575
H  1.980079 0.752746 -3.420728
H  5.846933 -0.993502 -0.776622
H  -0.8275 4.732412 0.410295
H  0.733677 4.666896 1.322397
H  -0.821577 4.332468 2.176475
H  4.429115 -3.203996 -0.132256
H  4.303113 0.946161 -4.344564
H  6.245317 0.033001 -3.023507
H  2.248983 -0.846882 3.700529
H  4.200555 -4.371719 2.066589
H  3.081654 -3.20506 3.998898
H  0.95535 1.874889 2.039972
