program: Gaussian 09
title: 000278580
version: EM64L-G09RevD.01
frameworkgroup: C1[X(C5H8O3)]
method: RPBEPBE
basis: SDD
operation: Freq
keyword: #p
keyword: freq=noraman
keyword: PBEPBE/SDD
title: #p freq=noraman PBEPBE/SDD
converged: NO YES NO NO
title: Mulliken charges:
elementType: O O O C C C C C H H H H H H H H
charge: -0.332383 -0.450374 -0.441608 -0.109056 -0.092855 -0.168385 -0.466440 -0.134805 0.248681 0.246808 0.252141 0.228293 0.253170 0.266489 0.349182 0.351142
chargesum: 0.00000
title: Mulliken charges with hydrogens summed into heavy atoms:
elementType: O O O C C C C C
charge: -0.332383 -0.101192 -0.090466 0.139625 0.153952 0.083757 0.015023 0.131683
polarizability: 6.18541734e+01 1.17976860e+00 5.58765241e+01 2.16068544e+00 1.07674397e+00 5.65780984e+01
1716.lowfreq: -15.1463 -0.0009 -0.0001 0.0006 10.4554 19.8777 139.3121 203.4651 223.9920
frequency: 139.2918 203.4615 223.9851 281.6694 311.1942 398.0760 430.1699 489.3233 611.5686 661.2252 746.2284 762.1441 790.0790 822.4585 893.8643 926.9707 941.7833 977.0523 1005.9809 1017.8990 1050.8460 1076.6498 1140.0741 1159.2688 1191.4406 1219.8316 1253.0368 1272.5907 1288.9595 1313.2917 1349.1760 1381.5813 1389.2013 1436.6050 3015.0429 3027.0801 3087.1869 3109.4931 3138.3941 3162.0466 3444.2457 3575.8362
redmass: 4.4361 1.4599 2.8507 2.6223 5.9100 3.3956 3.5816 5.1998 1.0806 6.8262 4.3935 5.4131 3.4961 3.0007 2.1637 1.7547 2.1820 5.6098 1.5152 2.2023 1.8550 1.4338 1.1397 1.1617 1.2183 1.6682 1.6502 1.3439 1.7184 1.4892 1.7111 2.1864 1.2071 1.0928 1.0618 1.0865 1.1010 1.0889 1.0903 1.0988 1.0649 1.0669
irintensity: 10.2058 78.1870 81.3019 13.1102 2.5978 12.4234 7.4056 4.3109 116.7568 14.8162 16.7094 4.7418 33.9555 12.2437 32.1560 19.9884 12.3769 82.6692 2.5654 67.3013 13.6731 23.2267 9.2817 6.5006 12.7214 14.7661 18.7947 14.4851 13.7395 7.1563 1.5905 3.3286 63.3152 14.5559 16.9413 30.1071 10.9555 19.9393 14.8227 23.2464 29.9242 7.6010
temp: 298.150 k
press: 1.00000 atm
elementType: 8 8 8 6 6 6 6 6 1 1 1 1 1 1 1 1
symmnumber: 1
zpe: 333257.5 jmol-1
zpe.correction: 0.126931 hartree
zpe.thermalcorrener: 0.134273 hartree
zpe.thermalcorrenthalpy: 0.135218 hartree
zpe.thermalcorrgfe: 0.095729 hartree
zpe.sumelectzpe: -420.304005 hartree
zpe.sumelectthermal: -420.296662 hartree
zpe.sumelectthermalent: -420.295718 hartree
zpe.sumelectthermalfe: -420.335207 hartree
dipole: -1.8123 -2.8140 0.5912
dipole: 3.3989
quadrupole: -45.6777 -50.7848 -45.5943
quadrupole: 1.8300 7.1939 1.0285
quadrupole: 1.6746 -3.4325 1.7579 1.8300 7.1939 1.0285
hfenergy: -420.4309357 hartree
pointgroup: C01 [X(C5H8O3)]
dipole: -0.1229453 -1.2867887 0.342335 debye
dipolederiv: -0.5828702 -0.0018419 0.1855476 -0.0081616 -0.4936873 0.0986343 0.2008046 0.0555255 -0.5502113 -0.843312 -0.099321 0.0516516 -0.0395056 -0.4777932 0.2379302 0.1703416 0.249029 -0.3060887 -0.4271296 -0.1689777 -0.0198676 -0.1582454 -0.5973158 0.1277068 -0.0508786 0.1428528 -0.6389404 0.1851525 -0.0162557 -0.0246486 0.0463977 0.2430637 0.0352588 -0.1199989 -0.019778 0.0912931 0.2435892 -0.1036309 -0.1118385 -0.0850413 0.2477777 -0.0133195 -0.0153712 0.0583408 0.3188795 0.5830754 0.1357989 -0.0063361 0.0748005 0.2168449 -0.1465993 -0.1177542 -0.18005 0.2469816 -0.0832513 0.1020695 -0.1093855 0.0800313 -0.0333073 -0.0243283 -0.0635328 0.0292658 -0.1328217 0.3455582 0.1335605 -0.0288221 0.0360476 0.3635676 -0.0970258 0.0117086 -0.1775079 0.4703956 0.0371086 -0.0037729 -0.0048794 -0.0010359 -0.1135618 -0.0602314 -0.0047168 -0.0689132 0.0947977 -0.0101852 0.1019177 -0.0632521 0.0940273 0.0298335 0.0368358 -0.0560991 0.0225006 0.0040206 -0.0410346 -0.0305858 -0.0527428 -0.0090884 0.0504329 0.0278834 -0.0478627 0.0465027 -0.1381953 0.0621279 0.0106584 0.0889137 -0.0024672 0.060923 0.0622998 0.0543488 0.052517 -0.081173 0.0138955 -0.0869122 -0.0361929 -0.0795502 -0.0368772 -0.0677586 -0.0173779 -0.0213152 0.0907666 -0.0491598 0.0544307 0.0554616 0.0757055 0.0220441 -0.0165031 0.0495837 -0.0040636 0.0333855 0.3533007 -0.0595482 0.0136847 -0.1049131 0.1562571 -0.1257836 -0.0324481 -0.1473128 0.1817994 0.2131347 0.0324105 0.0627065 0.0809987 0.3617981 -0.0749996 0.0392531 -0.0375935 0.3151107 unknown
polarizability: 59.7295118|3.2673372|58.3700102|1.0807907|1.7034043|56.2092739 unknown
InChI: InChI=1S/C5H8O3/c6-2-1-3-5(8-3)4(2)7/h2-7H,1H2
charge 0 multiplicity 1
16 atoms
O  1.565577 -0.360283 -0.815597
O  -1.960415 -1.033531 0.399126
O  -0.086786 1.925132 -0.800054
C  0.357093 -1.185222 -0.381945
C  1.225779 -0.568968 0.670302
C  -0.946768 -0.384311 -0.454076
C  0.50704 0.632798 1.266271
C  -0.581532 0.981137 0.204566
H  0.395821 -2.241347 -0.668743
H  1.986208 -1.133293 1.217546
H  -1.313399 -0.230313 -1.486782
H  0.040305 0.333569 2.223538
H  1.169698 1.49576 1.447329
H  -1.476439 1.446446 0.641132
H  -2.373636 -1.788716 -0.08917
H  0.733254 1.506444 -1.185843
