program: Gaussian 09
title: 000278584
version: EM64L-G09RevD.01
frameworkgroup: C1[X(C6H12O4)]
method: RPBEPBE
basis: SDD
operation: Freq
keyword: #pfreq=noraman
keyword: PBEPBE/SDD
title: #p freq=noraman PBEPBE/SDD
converged: YES YES NO NO
title: Mulliken charges:
elementType: O O O O C C C C C C H H H H H H H H H H H H
charge: -0.482707 -0.479978 -0.458244 -0.473524 -0.122224 -0.114513 -0.059041 -0.113188 -0.438590 -0.442040 0.226272 0.229174 0.203325 0.212942 0.220433 0.230620 0.224656 0.199735 0.367232 0.364640 0.357899 0.347119
chargesum: 0.00000
title: Mulliken charges with hydrogens summed into heavy atoms:
elementType: O O O O C C C C C C
charge: -0.115475 -0.115338 -0.100345 -0.126404 0.104048 0.114661 0.144284 0.099754 0.012463 -0.017648
polarizability: 8.65695524e+01 -1.48377665e+00 8.10002163e+01 1.78088394e-01 6.93999474e-01 5.95746033e+01
1716.lowfreq: -14.1752 -0.0007 -0.0006 -0.0005 12.1616 14.8466 97.4557 101.7413 207.7652
frequency: 97.4372 101.7300 207.7549 221.4402 243.6076 263.2514 274.5740 298.9553 373.0665 398.4042 420.0697 432.5575 442.0480 466.8393 474.2242 511.8440 533.7321 591.5252 837.4592 846.4778 903.3925 936.7875 979.2343 994.9433 1027.0621 1053.4208 1066.1222 1069.9807 1083.5687 1099.0612 1127.8844 1169.2818 1203.2835 1216.3560 1228.6466 1253.4633 1296.3017 1304.2496 1308.8757 1316.7797 1322.7702 1337.0578 1382.2737 1389.6302 1392.2103 1396.5919 1471.6187 1474.9505 2938.2796 2953.8560 2961.6104 2980.3019 2988.5368 3001.2070 3047.1583 3073.0962 3533.7349 3557.3776 3560.6820 3582.5777
redmass: 4.7000 6.3957 3.3863 4.1484 2.3917 2.6208 2.4775 1.5320 4.4919 3.2781 2.2186 1.3497 1.2691 1.4466 2.2659 4.8961 2.3811 3.6116 1.8166 1.8300 2.6484 3.8338 2.9338 2.9974 3.1283 3.4201 2.4903 2.3151 2.0196 1.9033 1.6528 1.2008 1.2829 1.2014 1.2216 1.2258 1.2175 1.2877 1.2807 1.2361 1.2841 1.4498 1.8463 1.4227 1.6280 1.6392 1.0902 1.0940 1.0827 1.0829 1.0829 1.0828 1.0629 1.0651 1.1012 1.1008 1.0652 1.0654 1.0655 1.0664
irintensity: 3.4183 2.2828 4.2273 10.1471 4.6319 42.2162 27.6381 86.6225 8.9476 13.1093 21.0691 84.4942 201.3043 111.7823 53.7737 26.5483 16.6683 35.8596 22.4922 15.4732 22.4701 71.5650 11.6502 132.4101 47.7412 68.6928 18.9332 22.0068 33.3291 33.3357 6.1819 27.1144 18.0712 21.0945 4.7019 24.7987 1.1858 36.8854 35.2885 7.0664 8.4026 27.2100 3.9553 3.2081 4.1286 18.0128 13.6285 9.7488 25.1059 4.8052 2.8106 81.6731 64.1415 30.6076 46.2934 38.4317 14.0979 16.0740 22.8709 6.2899
temp: 298.150 k
press: 1.00000 atm
elementType: 8 8 8 8 6 6 6 6 6 6 1 1 1 1 1 1 1 1 1 1 1 1
symmnumber: 1
zpe: 478633.2 jmol-1
zpe.correction: 0.182302 hartree
zpe.thermalcorrener: 0.192772 hartree
zpe.thermalcorrenthalpy: 0.193716 hartree
zpe.thermalcorrgfe: 0.147396 hartree
zpe.sumelectzpe: -535.890057 hartree
zpe.sumelectthermal: -535.879587 hartree
zpe.sumelectthermalent: -535.878643 hartree
zpe.sumelectthermalfe: -535.924964 hartree
dipole: 3.1218 -1.4602 -0.4175
dipole: 3.4716
quadrupole: -62.4608 -57.9032 -60.8351
quadrupole: -6.5899 -3.2770 0.3467
quadrupole: -2.0611 2.4965 -0.4354 -6.5899 -3.2770 0.3467
hfenergy: -536.0723592 hartree
pointgroup: C01 [X(C6H12O4)]
dipole: -1.2654967 0.5055561 -0.0919999 debye
dipolederiv: -0.5496946 0.2770975 0.0960621 0.2880901 -0.7232578 0.1054142 0.0836459 0.130961 -0.4959938 -0.454917 -0.198675 -0.1448243 -0.2184437 -0.841149 0.0255891 -0.1601413 -0.0007742 -0.4823002 -0.9263388 -0.0628007 0.0562958 -0.0658225 -0.3001016 -0.1325556 0.0734011 -0.1398674 -0.501394 -0.9093389 -0.1280247 0.0917173 -0.1499745 -0.3755445 -0.1729315 0.1431289 -0.1570308 -0.4424817 0.2230417 -0.2397855 0.0117344 -0.2409022 0.4685321 -0.1186788 -0.0186633 -0.0919117 0.3291467 0.2148322 0.2449699 0.0954244 0.207982 0.4792504 0.0756987 0.0778428 0.0387539 0.3184598 0.6672766 -0.0381221 -0.0963912 0.0204358 0.2498982 0.0580017 -0.0379376 0.0545452 0.3982054 0.6854298 0.0880171 -0.0975718 0.005625 0.1860843 0.0458158 -0.0569967 0.0606926 0.3387353 -0.0044102 0.0182599 0.0074537 0.0546377 0.0096977 0.0201404 -0.0384223 -0.0119774 0.1256321 -0.0670071 -0.0271293 0.0338702 -0.1184277 -0.0077735 -0.0389223 0.0023112 -0.0136484 0.1002743 0.0146948 0.0363158 -0.0306048 0.0283444 0.0003486 0.0260599 -0.0276612 0.0407677 -0.1777294 0.0352827 -0.0227787 -0.0132963 -0.0219776 -0.0112738 -0.0343835 -0.0220928 -0.0430558 -0.1692364 -0.0181705 -0.0043943 0.0338293 -0.007275 0.0143341 0.030774 0.0407538 -0.0009879 -0.2151005 -0.0219936 -0.0035784 0.019977 -0.0148555 0.0223733 -0.0055894 0.022612 -0.0016844 -0.1975415 0.0535159 0.0188535 -0.0064737 0.0270078 0.0843593 -0.022075 0.009822 0.0398935 -0.1483959 0.0108156 -0.0910113 -0.020346 -0.0805404 -0.1009638 -0.0498025 -0.033532 -0.0662474 0.0688939 0.0586316 -0.0214525 -0.0017835 -0.026247 0.0716302 0.032175 0.0224268 -0.0319105 -0.145114 -0.0476399 0.1225405 -0.0327969 0.1042534 -0.1118244 0.0397884 -0.0601433 0.0638414 0.0628564 0.2900012 -0.1508841 -0.0801906 -0.1139154 0.2253386 -0.0333186 -0.0861179 -0.0406717 0.3229516 0.1262005 0.0019258 0.0785952 0.0414883 0.3894576 -0.05311 0.0849969 -0.0507963 0.3101451 0.3565408 0.0887946 0.0146105 0.1188093 0.1377914 0.0759261 0.014504 0.0880209 0.3174264 0.2632476 0.0918621 -0.0152909 0.1617078 0.1327928 0.1259839 -0.0337369 0.1330877 0.2825603 unknown
polarizability: 86.616898|-1.1970009|80.8566017|-1.6568804|-0.5654654|59.6708723 unknown
InChI: InChI=1S/C6H12O4/c7-3-1-2-4(8)6(10)5(3)9/h3-10H,1-2H2
charge 0 multiplicity 1
22 atoms
O  1.568465 -1.857863 0.179783
O  -1.237821 -2.093841 -0.330247
O  2.773039 0.65628 -0.423781
O  -2.845695 0.157348 0.319847
C  0.750532 -0.747899 -0.326154
C  -0.687822 -0.835803 0.191649
C  1.429751 0.546278 0.148278
C  -1.506883 0.379211 -0.265963
C  0.620469 1.778319 -0.290742
C  -0.844594 1.689401 0.210662
H  0.733347 -0.770406 -1.43772
H  -0.689986 -0.855396 1.303509
H  1.491229 0.504012 1.259468
H  -1.575944 0.371031 -1.376294
H  0.65247 1.842432 -1.395994
H  1.107725 2.689208 0.098667
H  -0.875702 1.71876 1.317682
H  -1.420688 2.561121 -0.155615
H  1.08896 -2.701521 -0.024394
H  -2.197619 -2.120139 -0.081986
H  3.225246 -0.214306 -0.267589
H  -3.472781 0.848873 -0.007369
