program: Gaussian 09
title: 000278583
version: EM64L-G09RevD.01
frameworkgroup: C1[X(C8H12Br2O2)]
method: RPBEPBE
basis: SDD
operation: Freq
keyword: #p
keyword: freq=noraman
keyword: PBEPBE/SDD
title: #p freq=noraman PBEPBE/SDD
converged: YES YES NO NO
title: Mulliken charges:
elementType: Br Br O O C C C C C C C C H H H H H H H H H H H H
charge: -0.000247 -0.000147 -0.276939 -0.277044 -0.072534 -0.072360 -0.500941 -0.500869 -0.426079 0.316761 -0.668449 -0.690696 0.287515 0.287663 0.331448 0.331375 0.249265 0.305092 0.230723 0.230801 0.230763 0.224214 0.236601 0.224087
chargesum: 0.00000
title: Mulliken charges with hydrogens summed into heavy atoms:
elementType: Br Br O O C C C C C C C C
charge: -0.000247 -0.000147 -0.276939 -0.277044 0.214981 0.215302 -0.169493 -0.169494 0.128278 0.316761 0.023838 -0.005795
polarizability: 1.59890486e+02 -6.97323965e-03 1.03461943e+02 -1.25560214e+01 -3.20775104e-03 9.56363295e+01
1716.lowfreq: -0.0003 0.0004 0.0004 6.8461 13.5366 13.7348 43.5636 63.0043 77.0648
frequency: 42.4460 62.9765 77.0605 137.2657 152.7695 158.4073 195.5953 217.2989 244.0203 254.0969 294.4699 315.4810 358.4680 413.6876 481.6379 566.2832 600.4428 607.2595 607.9622 732.4253 760.0752 782.0904 798.8808 839.8471 900.1066 917.7220 926.7239 937.7533 964.0206 969.4850 976.9087 990.7582 1086.6670 1087.3932 1139.3567 1147.5954 1184.9237 1187.9492 1195.6386 1201.7377 1211.3310 1268.5704 1276.9935 1277.4050 1293.5348 1309.0440 1324.7403 1381.9741 1393.9743 1433.3853 1453.2393 1453.4685 1472.0584 1473.5826 2987.0530 2995.2175 3009.6787 3049.4036 3064.3376 3093.6518 3103.4813 3106.5668 3113.3111 3113.7505 3116.4728 3120.8866
redmass: 4.6130 26.2749 4.0334 4.8369 2.9560 1.3582 6.7257 1.0802 3.8277 3.8337 3.4272 2.5384 2.9080 2.9530 3.8081 2.8202 4.5085 4.7027 6.2436 5.8799 7.5465 3.7721 6.5523 3.5798 2.6606 1.9752 3.1592 2.0480 2.0139 3.2442 2.6536 1.5770 1.5152 1.9057 1.8096 1.0930 1.2616 1.5373 1.9845 1.9944 1.4432 1.9206 1.7006 1.3089 1.3027 1.5896 1.5544 1.2930 1.2266 1.0726 1.0497 1.0468 1.0672 1.0463 1.0680 1.0355 1.0356 1.0874 1.0892 1.0997 1.1005 1.0941 1.0894 1.0976 1.0898 1.1007
irintensity: 1.9398 0.0633 0.3961 0.0004 0.0172 0.0761 5.6820 0.9607 5.6004 4.0248 7.9036 4.1583 2.3539 0.3377 13.8894 26.1775 14.7848 5.5205 0.5388 2.5957 13.6884 63.1680 1.7540 20.2364 57.6232 0.1808 1.2606 13.6915 51.5330 148.2596 11.0787 2.3283 3.1195 0.9218 56.7459 0.1481 62.2637 19.1388 66.7660 44.2172 3.0748 14.0867 29.2373 2.4449 2.3267 15.2415 1.7814 48.9524 27.2702 26.9510 8.3901 0.1999 0.4071 15.4459 6.9928 9.8813 10.6999 5.2164 22.3965 30.5189 4.2507 2.4990 1.0059 23.8234 1.4984 23.1056
temp: 298.150 k
press: 1.00000 atm
elementType: 35 35 8 8 6 6 6 6 6 6 6 6 1 1 1 1 1 1 1 1 1 1 1 1
symmnumber: 1
zpe: 492938.0 jmol-1
zpe.correction: 0.187750 hartree
zpe.thermalcorrener: 0.200475 hartree
zpe.thermalcorrenthalpy: 0.201419 hartree
zpe.thermalcorrgfe: 0.146643 hartree
zpe.sumelectzpe: -488.466493 hartree
zpe.sumelectthermal: -488.453768 hartree
zpe.sumelectthermalent: -488.452824 hartree
zpe.sumelectthermalfe: -488.507599 hartree
dipole: -3.4038 0.0020 0.6238
dipole: 3.4604
quadrupole: -87.8849 -99.1138 -84.5737
quadrupole: 0.0042 2.1162 -0.0023
quadrupole: 2.6392 -8.5896 5.9504 0.0042 2.1162 -0.0023
hfenergy: -488.6542428 hartree
pointgroup: C01 [X(C8H12Br2O2)]
dipole: -1.2734686 -0.1176921 -0.4668544 debye
dipolederiv: -0.4097422 -0.2245802 -0.0668871 -0.1810607 -0.3032316 -0.0734421 -0.1091038 -0.1354715 -0.1815355 -0.4008512 0.1598967 -0.1740337 0.1011857 -0.1817811 0.0746836 -0.1855618 0.1374427 -0.3113621 -1.1680283 -0.3024474 -0.0182248 -0.1778752 -0.6003244 0.0395807 -0.0080286 -0.0222397 -0.3927126 -1.1565616 0.2610246 -0.1778203 0.1615287 -0.5604522 0.0634325 -0.10247 0.1239211 -0.4442225 0.5563145 0.1188959 0.0387985 -0.1053676 0.1488577 0.0504313 -0.0326516 -0.0166257 0.1812936 0.5565833 -0.0911344 0.0971219 0.062516 0.1432185 -0.0286024 -0.0788997 0.0412116 0.1875956 0.5719504 0.3886635 0.1669666 0.2325897 0.3715462 0.1292519 0.3486292 0.3316064 0.1651309 0.5592432 -0.2505352 0.3449759 -0.0241037 0.1144988 -0.1019987 0.4123179 -0.3074038 0.4340952 -0.1909535 -0.0068544 -0.0324458 -0.0152094 -0.0078541 -0.0445932 -0.0626087 -0.0440248 -0.1538283 1.3062857 0.0000728 0.0223009 -0.0145423 0.8063419 -0.0350417 -0.0281949 -0.0344325 0.6933526 -0.1709439 0.0204549 0.0653445 0.0468666 -0.0455578 -0.0535419 0.1587219 -0.0544211 -0.2141295 -0.1031821 -0.0150304 -0.0586873 -0.0265903 0.0119871 -0.0513805 -0.1016331 -0.0509579 -0.1574499 -0.0209941 -0.001711 -0.0054283 0.0149267 -0.0122163 -0.0682347 -0.039676 -0.0878121 -0.0472799 -0.0217221 0.0000908 -0.0043613 -0.0318474 0.0486204 0.0092775 -0.024586 0.0297753 -0.1074416 -0.0040769 -0.0274714 -0.0785387 -0.0431831 -0.0235223 0.0101851 -0.0398263 0.0228618 0.0054312 -0.0030725 -0.018587 -0.0811453 0.0149553 -0.0303651 0.0138352 -0.0565089 0.0003093 0.0111993 0.074153 -0.0335013 -0.1126641 -0.0332553 -0.0412744 0.0072343 -0.1118672 0.0071935 -0.0231334 -0.0309429 0.0222863 0.0730237 0.0173108 0.0907556 0.0062568 0.0558242 0.0063997 0.1144663 -0.0068151 0.0985625 -0.007812 0.1310159 -0.0297425 0.030046 -0.0170291 0.0483398 0.0837641 -0.0111049 -0.0880894 0.0456595 -0.1207179 -0.0291211 0.0413617 0.0548983 0.0229077 0.0875701 0.0155482 -0.0346974 -0.1237544 -0.0293803 0.0851071 -0.0414131 -0.1052706 -0.0416155 -0.0530125 0.0169034 0.0836124 -0.0412911 0.1244114 -0.0326358 0.0469181 -0.0463417 0.0077437 0.0850491 0.0321657 0.0354885 0.1196843 0.0274823 0.0953044 -0.044173 0.0920925 -0.0436755 -0.0398133 0.0098438 -0.0944094 0.0092185 -0.1316559 -0.0181593 0.0199265 0.0277739 0.0589673 0.0769731 unknown
polarizability: 153.3994629|5.7403231|103.2208155|22.3507611|-0.5927792|102.3684796 unknown
InChI: InChI=1S/C8H12Br2O2/c1-8(2)11-6-4(9)3-5(10)7(6)12-8/h4-7H,3H2,1-2H3
charge 0 multiplicity 1
24 atoms
Br 2.866851 2.086314 0.236445
Br 2.819898 -1.601959 1.285885
O  -1.097598 1.13724 -0.542491
O  -1.126566 -1.113389 0.09587
C  0.133596 0.950956 0.264245
C  0.114443 -0.560915 0.693073
C  1.327115 1.128419 -0.7020
C  1.29771 -1.246938 -0.027768
C  1.713372 -0.291161 -1.164026
C  -2.026512 0.032912 -0.190667
C  -2.848588 0.397711 1.055781
C  -2.860057 -0.305692 -1.419635
H  0.147938 1.654294 1.112673
H  0.11599 -0.713908 1.784539
H  1.07129 1.813314 -1.522304
H  1.021158 -2.254819 -0.367075
H  1.088709 -0.534951 -2.048222
H  2.767662 -0.388715 -1.461587
H  -3.479507 1.278624 0.847482
H  -3.496517 -0.448245 1.34183
H  -2.191247 0.636197 1.910576
H  -3.487966 0.556265 -1.700653
H  -2.197684 -0.557611 -2.263011
H  -3.51449 -1.167546 -1.207058
