program: Gaussian 09
title: 000278589
version: EM64L-G09RevD.01
frameworkgroup: C1[X(C12H23ClN2O)]
method: RPBEPBE
basis: SDD
operation: Freq
keyword: #p
keyword: freq=noraman
keyword: PBEPBE/SDD
title: #p freq=noraman PBEPBE/SDD
converged: YES YES NO NO
title: Mulliken charges:
elementType: Cl O N N C C C C C C C C C C C C H H H H H H H H H H H H H H H H H H H H H H H
charge: -0.091594 -0.322326 -0.432806 -0.404222 0.043951 -0.485365 -0.493406 -0.030258 -0.436778 -0.465460 -0.037727 -0.734878 -0.738421 0.302501 -0.334290 -0.548362 0.188827 0.196597 0.214538 0.225160 0.174744 0.258831 0.194615 0.234981 0.214548 0.200396 0.192311 0.210190 0.224976 0.206558 0.207663 0.210828 0.224193 0.286125 0.292028 0.267754 0.239032 0.264365 0.280180
chargesum: 0.00000
title: Mulliken charges with hydrogens summed into heavy atoms:
elementType: Cl O N N C C C C C C C C C C C C
charge: -0.091594 -0.322326 -0.146681 -0.112194 0.232778 -0.074231 -0.093502 0.228573 -0.007182 -0.050516 0.154584 -0.093153 -0.095737 0.302501 0.172496 -0.003816
polarizability: 1.86144698e+02 -2.88338531e+00 1.50887689e+02 -3.67051020e+00 1.73829016e+00 1.25820765e+02
1716.lowfreq: -16.6821 -10.3857 -0.0016 -0.0010 -0.0008 10.3850 14.9509 21.4575 29.8720
frequency: 12.6801 18.9120 28.4266 38.4139 66.6325 73.6592 100.2399 135.5548 159.4618 168.6919 198.7916 217.1463 237.5007 241.6916 282.4735 326.2792 349.7165 355.5810 373.3114 389.8052 394.5350 434.1991 454.6647 466.6291 482.9193 497.5507 545.0192 591.8744 634.1222 698.5551 712.6295 772.4246 789.6830 816.3751 847.8920 869.0144 901.8663 908.2222 921.2930 930.9552 945.8888 952.8673 975.3023 982.7661 1012.6486 1045.8554 1056.9204 1066.4556 1085.3361 1090.4776 1128.4541 1138.1751 1150.6963 1160.6646 1170.1567 1185.4013 1191.2137 1213.1598 1227.3291 1238.7064 1259.0005 1276.9568 1290.0180 1296.9405 1307.2553 1317.4770 1321.0508 1324.4825 1329.1467 1343.7697 1362.6730 1365.2333 1371.7705 1374.0962 1392.0960 1436.5078 1439.5010 1452.2829 1455.2833 1460.2994 1465.7273 1469.3251 1473.5153 1476.2787 1482.6465 1495.5504 1502.6377 1624.5667 2918.4315 2934.3535 2944.9796 2961.1911 2969.3823 2972.9636 2975.3172 2981.9888 2990.2291 3033.5211 3037.7775 3041.3127 3046.9429 3048.6279 3050.9575 3058.7538 3063.1369 3066.0701 3076.6813 3081.4968 3152.6956 3544.6137 3551.9080
redmass: 3.8547 4.4078 4.1036 3.6182 5.5963 4.9003 3.1585 2.9572 1.4637 3.5884 2.2935 1.7444 2.5397 1.7103 2.3750 1.5926 2.3007 1.6085 1.9813 2.3712 2.9490 2.6694 2.4040 2.8583 2.2119 2.6726 1.3364 4.0567 2.9770 3.8752 8.6205 1.5134 2.0579 2.6496 2.5147 2.3377 2.3118 1.1949 1.5394 1.8605 2.4053 1.4444 1.8758 2.3808 1.6921 1.9874 2.3642 1.9441 1.7392 1.6517 1.6021 1.9453 1.8669 1.7982 1.7185 2.0142 1.4667 1.3550 1.5784 1.3902 1.2370 1.3039 1.3032 1.1867 1.4258 1.5093 1.4985 1.3920 1.6457 1.4047 1.3211 1.4562 1.3363 1.2158 1.2060 1.1611 1.1066 1.3057 1.1491 1.0887 1.0868 1.0817 1.1092 1.0555 1.0928 1.0491 2.1758 5.1727 1.0787 1.0720 1.0802 1.0702 1.0366 1.0370 1.0631 1.0618 1.0593 1.0901 1.0881 1.1006 1.0931 1.0970 1.0994 1.0987 1.0620 1.0980 1.0983 1.0977 1.1119 1.0774 1.0767
irintensity: 0.5525 0.0792 0.0920 1.0648 13.7753 6.0086 4.4337 6.6578 0.3526 1.0536 0.4385 1.2941 4.8674 2.2857 2.1570 7.5995 1.3855 20.7930 3.3288 3.0520 1.0416 1.2643 1.2440 9.3648 0.2108 2.4583 206.2839 37.0108 9.5467 5.5149 10.8844 0.3979 0.7489 15.1520 1.8540 9.8445 5.9264 2.7038 6.1090 14.5964 6.8668 0.0757 18.6020 9.7697 10.4709 0.4775 3.5550 1.2116 2.4748 0.2975 0.9622 11.3487 7.9138 4.8127 5.9409 8.2110 1.2292 37.3777 48.5720 143.4232 4.6251 12.7229 4.3632 24.5104 18.1199 26.0544 10.6370 13.3680 9.8671 1.2589 6.0320 1.5468 2.3207 18.4957 22.9663 39.4080 18.6652 67.2166 14.1918 9.5376 18.6013 1.6654 5.0151 2.6580 44.4056 21.5050 645.2821 175.7683 0.4285 15.0553 33.1796 55.7934 30.5901 36.5455 30.6114 40.1381 53.8573 44.1006 38.3060 24.7898 55.5689 7.1850 55.0351 1.0557 24.3576 94.6520 42.9817 46.4198 17.1702 19.6425 15.6061
temp: 298.150 k
press: 1.00000 atm
elementType: 17 8 7 7 6 6 6 6 6 6 6 6 6 6 6 6 1 1 1 1 1 1 1 1 1 1 1 1 1 1 1 1 1 1 1 1 1 1 1
symmnumber: 1
zpe: 892015.2 jmol-1
zpe.correction: 0.339751 hartree
zpe.thermalcorrener: 0.358280 hartree
zpe.thermalcorrenthalpy: 0.359224 hartree
zpe.thermalcorrgfe: 0.289536 hartree
zpe.sumelectzpe: -1114.599749 hartree
zpe.sumelectthermal: -1114.581220 hartree
zpe.sumelectthermalent: -1114.580275 hartree
zpe.sumelectthermalfe: -1114.649963 hartree
dipole: -1.8562 1.5900 -0.0726
dipole: 2.4451
quadrupole: -104.4500 -116.2159 -105.3410
quadrupole: -3.0156 -3.8038 -1.1675
quadrupole: 4.2189 -7.5470 3.3280 -3.0156 -3.8038 -1.1675
hfenergy: -1114.9394994 hartree
pointgroup: C01 [X(C12H23Cl1N2O1)]
dipole: -0.7636267 0.5849802 0.0087953 debye
polarizability: 186.0891767|-0.7665327|150.5786149|-5.5042451|2.2147104|126.18536 unknown
InChI: InChI=1S/C12H23ClN2O/c1-9(2)10-3-5-11(6-4-10)15-12(16)14-8-7-13/h9-11,14-15H,3-8H2,1-2H3
charge 0 multiplicity 1
39 atoms
Cl 5.367044 2.362292 -0.059444
O  2.413457 -1.919996 -0.15072
N  0.850946 -0.239758 0.308188
N  2.933527 0.311874 -0.642127
C  -2.895046 -0.006607 0.186262
C  -2.010337 -0.710936 -0.879457
C  -1.986866 0.588431 1.299009
C  -0.158979 -1.176549 0.848078
C  -1.062616 -1.76729 -0.266371
C  -1.028088 -0.465002 1.910035
C  -3.842566 1.062844 -0.447734
C  -4.789607 0.440607 -1.506135
C  -4.68699 1.808761 0.616442
C  2.079083 -0.690978 -0.15907
C  4.275761 -0.017023 -1.114798
C  5.383064 0.458885 -0.173395
H  -3.540026 -0.78272 0.659856
H  -1.412411 0.057049 -1.41587
H  -2.644214 -1.20078 -1.640456
H  -2.602311 1.015627 2.111818
H  -1.412157 1.441851 0.873528
H  0.410958 -2.000742 1.313469
H  -1.663161 -2.588442 0.176351
H  -0.422172 -2.220045 -1.045354
H  -0.37946 0.000195 2.677166
H  -1.634884 -1.236927 2.42344
H  -3.200145 1.812589 -0.961536
H  -5.483317 1.204574 -1.903389
H  -4.242731 0.012651 -2.364326
H  -5.400156 -0.365866 -1.054852
H  -5.270253 1.092021 1.227278
H  -5.404443 2.494936 0.129128
H  -4.064955 2.411805 1.30055
H  0.593963 0.743534 0.214677
H  2.704457 1.300623 -0.527458
H  4.321186 -1.121948 -1.174694
H  4.446572 0.393277 -2.12819
H  6.387212 0.206813 -0.546138
H  5.236455 0.109066 0.85844
