program: Gaussian 09
title: 000278553
version: EM64L-G09RevD.01
frameworkgroup: C1[X(C15H21NO2)]
method: RPBEPBE
basis: SDD
operation: Freq
keyword: #p
keyword: freq=noraman
keyword: PBEPBE/SDD
title: #p freq=noraman PBEPBE/SDD
converged: NO YES NO NO
title: Mulliken charges:
elementType: O O N C C C C C C C C C C C C C C C H H H H H H H H H H H H H H H H H H H H H
charge: -0.283710 -0.259204 -0.314231 -0.065390 -0.404662 -0.439676 -0.392884 -0.391211 -0.385593 -0.372524 -0.305128 0.190323 0.219619 -0.342827 -0.338574 -0.219478 -0.217713 -0.222737 0.203895 0.181830 0.211026 0.221344 0.178481 0.198593 0.189311 0.192292 0.198465 0.198952 0.188480 0.241695 0.217142 0.224417 0.222498 0.239790 0.269902 0.271471 0.233010 0.230983 0.232024
chargesum: 0.00000
title: Mulliken charges with hydrogens summed into heavy atoms:
elementType: O O N C C C C C C C C C C C C C C C
charge: -0.283710 -0.259204 -0.072536 0.138504 -0.011806 -0.039852 -0.004979 -0.000454 0.001838 0.069035 0.157159 0.190323 0.219619 -0.072925 -0.067103 0.013532 0.013270 0.009287
polarizability: 2.37742827e+02 -2.57362021e+01 1.30506470e+02 6.82807131e+00 6.35787163e+00 1.56219139e+02
1716.lowfreq: -22.6171 -7.5847 -1.5985 0.0004 0.0005 0.0006 10.9303 19.4423 24.0727
frequency: -8.4269 18.3674 24.0654 54.4662 70.7027 83.7280 119.0883 141.6688 161.1055 196.5742 219.7928 225.8826 281.8384 315.1633 322.7621 355.4448 403.1747 411.7375 428.8235 441.0716 449.6143 467.5122 502.3096 567.6997 613.6710 657.9856 664.7758 679.3769 701.3371 755.8162 778.3789 787.2534 795.1568 820.8878 841.3740 864.4571 877.0221 890.7695 911.9136 917.4492 954.3659 959.9635 990.4393 995.5161 1007.8908 1019.3465 1033.7459 1043.6410 1046.5693 1051.5049 1067.3701 1078.1728 1086.5459 1100.2398 1111.5426 1142.9484 1163.8889 1173.4366 1181.1446 1188.4468 1207.0156 1245.1879 1250.8485 1253.5964 1256.1387 1280.6274 1302.3394 1306.7196 1314.2928 1325.5752 1329.0300 1335.0314 1336.3476 1341.6450 1361.0597 1384.8915 1389.4253 1437.3585 1448.1045 1455.6451 1459.2858 1460.7047 1463.5041 1469.4892 1476.4012 1477.3635 1487.5373 1584.0860 1610.6833 1620.2232 2918.9357 2948.3747 2953.1910 2964.2478 2964.9603 2965.4830 2967.9710 3024.1389 3025.0344 3026.7896 3030.1889 3035.1835 3037.8705 3046.1620 3124.3121 3129.4795 3142.2991 3155.0738 3167.0890 3179.4977 3420.3126
redmass: 3.6044 4.4290 4.0990 4.8638 4.0860 4.3219 2.3415 4.7301 3.8512 2.6932 1.8949 3.7770 4.1279 2.2345 3.1513 4.0357 2.8236 3.1556 3.1587 3.5373 2.3086 3.5285 3.0336 2.5282 6.4324 3.0427 1.8531 5.0737 1.5999 3.0186 1.6493 1.8717 2.1776 1.4486 2.0767 1.2449 1.7487 1.6116 6.2079 1.8697 1.4225 2.3252 6.2506 1.3868 1.3286 2.9221 2.3515 1.9568 1.6318 1.5964 2.0601 1.6826 1.8768 1.9594 2.4950 3.6877 2.1214 1.0570 1.1280 1.4968 1.2904 3.4103 1.2691 1.3131 1.3552 1.1865 1.1704 1.2774 1.3186 1.4038 1.2719 1.4192 1.4402 1.4858 1.4524 1.3887 10.1083 2.2360 1.1292 1.1578 1.1069 1.0937 1.0885 1.0842 1.0967 2.2678 1.0845 6.7518 6.1660 9.2754 1.0682 1.0745 1.0653 1.0644 1.0693 1.0631 1.0632 1.0952 1.0715 1.0969 1.0997 1.0821 1.0996 1.0997 1.1054 1.0855 1.0892 1.0940 1.0980 1.0974 1.0737
irintensity: 0.3787 0.7887 0.1358 1.2733 0.6275 0.4257 0.7854 0.6236 0.2609 1.7329 0.4157 0.9045 11.9562 5.6015 14.1233 1.4854 0.0092 3.2421 2.0533 1.5923 1.9554 4.2630 10.9077 3.5106 0.6143 22.0903 70.2465 15.6289 98.6881 10.1716 2.5808 2.0184 21.3545 1.3740 4.2124 0.0338 8.7659 15.3683 25.8036 1.4406 4.2739 1.9283 1.3637 0.0057 0.4695 92.6368 15.0385 17.5682 43.1431 89.4368 49.8819 10.9304 35.7339 64.1197 0.1208 76.2691 0.4593 0.1235 40.1536 1.1240 5.9077 304.2460 3.5899 7.0364 4.8132 16.2022 0.0717 0.1631 2.3180 3.2619 1.3735 0.6753 0.1658 8.5454 17.8084 4.3959 3.0807 15.7400 16.1830 17.4098 10.2836 9.9332 11.0620 25.3113 3.5638 4.3491 5.6163 39.1413 10.3966 143.8481 51.7350 5.1827 19.3198 14.3528 46.3741 34.4424 73.1719 67.6859 42.9382 75.4851 12.5416 20.7880 59.8282 97.5665 14.2398 0.2522 12.1405 17.3052 21.4520 8.0568 0.4932
temp: 298.150 k
press: 1.00000 atm
elementType: 8 8 7 6 6 6 6 6 6 6 6 6 6 6 6 6 6 6 1 1 1 1 1 1 1 1 1 1 1 1 1 1 1 1 1 1 1 1 1
symmnumber: 1
zpe: 873953.9 jmol-1
zpe.correction: 0.332871 hartree
zpe.thermalcorrener: 0.349385 hartree
zpe.thermalcorrenthalpy: 0.350329 hartree
zpe.thermalcorrgfe: 0.286583 hartree
zpe.sumelectzpe: -788.026599 hartree
zpe.sumelectthermal: -788.010085 hartree
zpe.sumelectthermalent: -788.009141 hartree
zpe.sumelectthermalfe: -788.072887 hartree
dipole: 0.1107 1.0325 -1.3857
dipole: 1.7316
quadrupole: -90.1585 -110.5043 -106.7857
quadrupole: -4.0634 5.1996 0.6731
quadrupole: 12.3243 -8.0215 -4.3029 -4.0634 5.1996 0.6731
hfenergy: -788.35947 hartree
pointgroup: C01 [X(C15H21N1O2)]
dipole: -0.0775993 -0.4906038 0.466288 debye
polarizability: 232.4396093|-2.7180385|157.3125683|35.3472445|3.1053961|134.7162585 unknown
InChI: InChI=1S/C15H21NO2/c17-15(13-7-3-1-4-8-13)18-12-11-16-14-9-5-2-6-10-14/h1,3-4,7-8,14,16H,2,5-6,9-12H2
charge 0 multiplicity 1
39 atoms
O  1.391905 -0.609887 -0.927663
O  1.637603 1.678103 -0.528184
N  -2.327883 -0.068719 -1.230583
C  -3.567888 -0.457892 -0.510016
C  -3.775263 0.271599 0.849245
C  -4.788145 -0.231615 -1.432416
C  -5.094219 -0.16029 1.535736
C  -6.112901 -0.65129 -0.750204
C  -6.308675 0.068916 0.605333
C  -1.050437 -0.345696 -0.543323
C  0.08132 -0.341072 -1.58579
C  2.071027 0.502773 -0.41765
C  3.349887 0.120495 0.249719
C  4.147176 1.15616 0.803234
C  3.776668 -1.229755 0.345067
C  5.362258 0.843992 1.446417
C  4.993816 -1.536991 0.98927
C  5.787795 -0.502948 1.540487
H  -3.490716 -1.54754 -0.304919
H  -3.799483 1.366395 0.659969
H  -2.915667 0.078323 1.52054
H  -4.634232 -0.789354 -2.3749
H  -4.84064 0.846936 -1.697924
H  -5.226913 0.390756 2.487019
H  -5.034624 -1.237617 1.797605
H  -6.10264 -1.74812 -0.580656
H  -6.965821 -0.441509 -1.424286
H  -7.238701 -0.281521 1.093612
H  -6.42918 1.157624 0.42615
H  -2.38127 0.907466 -1.557027
H  -1.115684 -1.349566 -0.083451
H  -0.795179 0.37508 0.266586
H  0.135245 0.63362 -2.104012
H  -0.045697 -1.156989 -2.31257
H  3.796191 2.189874 0.717439
H  3.152861 -2.01769 -0.08562
H  5.976348 1.644273 1.873274
H  5.324278 -2.578805 1.062562
H  6.732383 -0.745222 2.040529
