program: Gaussian 09
title: 000025249
version: EM64L-G09RevD.01
frameworkgroup: C1[X(C21H32N2O)]
method: RPBEPBE
basis: SDD
operation: Freq
keyword: #p
keyword: freq=noraman
keyword: PBEPBE/SDD
title: #p freq=noraman PBEPBE/SDD
converged: YES YES NO NO
title: Mulliken charges:
elementType: O N N C C C C C C C C C C C C C C C C C C C C C H H H H H H H H H H H H H H H H H H H H H H H H H H H H H H H H
charge: -0.455803 -0.446330 -0.025579 -0.175621 -0.112440 0.392764 -0.125418 0.388367 0.221335 -0.539830 -0.541226 -0.081189 -0.549164 -0.505301 -0.490075 -0.476954 -0.585953 -0.799134 -0.848780 -0.558393 -0.817034 0.151529 0.215670 -0.503453 0.208086 0.241502 0.184288 0.214209 0.193529 0.219987 0.226198 0.233050 0.218529 0.220539 0.218750 0.199045 0.243555 0.212169 0.194241 0.202226 0.222747 0.224666 0.215536 0.241030 0.215583 0.244237 0.218364 0.221678 0.233159 0.221727 0.242142 0.224329 0.214066 0.322261 0.260259 0.316327
chargesum: 0.00000
title: Mulliken charges with hydrogens summed into heavy atoms:
elementType: O N N C C C C C C C C C C C C C C C C C C C C C
charge: -0.133542 -0.130002 -0.025579 0.032464 0.129062 0.392764 0.058870 0.388367 0.221335 -0.132092 -0.095041 0.151860 -0.110097 -0.087506 -0.034351 -0.080488 -0.138540 -0.126985 -0.164501 -0.103506 -0.136497 0.151529 0.215670 -0.243194
polarizability: 2.85839946e+02 -2.61067512e+00 2.22996815e+02 7.53224041e-01 1.64440991e+00 1.73016396e+02
1716.lowfreq: -16.4628 -0.0005 -0.0003 0.0005 4.3758 8.5423 34.7117 62.2588 75.1655
frequency: 34.6024 62.2378 75.1412 79.7887 104.4154 111.8204 147.8560 188.8900 193.4808 196.5194 214.5709 221.7250 243.2283 256.2465 270.0285 279.3446 286.7736 295.0943 296.7598 312.3494 314.2238 331.3276 348.8276 363.5882 374.3994 386.9648 389.7947 416.4920 431.8318 458.3687 476.7335 510.5717 530.8921 540.3125 543.2719 561.5141 579.9651 585.1781 643.3156 653.3544 660.1815 690.3003 698.5578 735.9134 758.7112 788.4721 812.5327 827.2604 835.2407 844.6862 855.5103 869.4498 900.8870 906.6190 912.3933 920.8613 926.5293 932.4755 951.9186 961.6232 965.0560 983.9841 994.8828 1003.2283 1015.1644 1033.8104 1038.1285 1050.7874 1060.1763 1073.2076 1075.9643 1083.5763 1098.2043 1099.3558 1115.8975 1123.3025 1136.3255 1138.3478 1139.5555 1165.7223 1170.2414 1180.3819 1185.0777 1190.1337 1201.6437 1205.9205 1215.1374 1227.4600 1232.7825 1236.1223 1248.4211 1254.2466 1270.4975 1274.4171 1275.9776 1281.9483 1288.9091 1299.6262 1311.3979 1313.2045 1319.9711 1327.5060 1331.2086 1333.8826 1339.4040 1344.0590 1348.9244 1358.2305 1360.7822 1362.2582 1391.3027 1393.7746 1395.2674 1398.0825 1455.2294 1455.8288 1463.1924 1464.7682 1466.0767 1467.3117 1467.9154 1470.0860 1472.2828 1480.9299 1486.3364 1488.3225 1489.1405 1489.8504 1494.1268 1593.6085 2894.7292 2914.9298 2938.5214 2948.0636 2949.0129 2952.2374 2953.0174 2964.2095 2969.3773 2971.9765 2985.2345 2988.6659 2991.3375 2999.0555 3000.3818 3010.6256 3013.0465 3014.5031 3017.1281 3029.0397 3046.3114 3048.5771 3061.0713 3071.9566 3077.7264 3078.5584 3080.4284 3084.8973 3097.0066 3212.5619 3538.1336 3613.3639
redmass: 4.4572 3.5876 2.8501 2.1278 4.8594 2.3484 1.6317 1.2243 3.8209 2.9603 2.3185 2.6862 2.2501 1.8960 1.6496 3.1595 2.0143 1.5804 1.5456 2.6449 2.6046 2.2360 2.3934 3.9162 2.3014 3.0471 2.8822 2.9878 3.4806 3.1153 3.0008 2.5326 2.8739 2.6127 2.9653 2.8534 2.3915 3.1115 2.7032 2.7315 2.2973 2.6362 3.5226 4.2908 3.2808 1.6016 2.1986 1.9217 1.3658 1.9860 2.2530 2.0586 2.2837 1.6014 1.8557 1.7381 3.3795 1.8517 2.0564 1.8721 2.0084 2.2207 2.2432 1.8461 2.1372 1.8129 2.3330 3.2640 2.2480 2.1136 1.5807 1.9167 2.7070 2.1966 1.7938 2.5596 2.0236 1.7899 1.9160 2.0355 1.7355 1.5693 3.1036 1.6901 1.6423 1.7387 1.8079 1.3674 1.5541 1.5181 1.4978 1.5637 1.6919 1.4621 1.4747 1.7111 1.3963 1.2961 1.4286 1.4284 1.9277 1.3827 1.7408 1.4655 1.4079 1.4235 1.5383 1.3957 1.8275 2.0560 1.2168 1.2100 1.3501 1.8381 1.0838 1.0998 1.1041 1.0813 1.0863 1.0649 1.0622 1.0667 1.0788 1.0658 1.6364 1.0989 1.3660 1.2751 1.0907 5.1098 1.0807 1.0800 1.0809 1.0647 1.0656 1.0620 1.0596 1.0609 1.0785 1.0391 1.0381 1.0612 1.0586 1.0403 1.0987 1.0976 1.0650 1.0974 1.0935 1.0988 1.1009 1.0994 1.0979 1.0978 1.0984 1.1025 1.0993 1.0978 1.0985 1.0974 1.0656 1.0819
irintensity: 0.7287 1.1045 0.2074 0.8885 0.9292 1.3090 0.3731 0.2305 1.1234 0.2493 0.6829 0.2021 0.1100 2.7999 40.2450 2.6701 1.0538 49.5340 18.2737 1.6907 28.3509 7.0144 0.4989 4.1039 1.8922 2.3116 4.8589 0.6245 0.0236 7.9642 1.8762 4.7250 0.4419 1.7430 1.0250 5.4413 24.3615 11.0134 3.4104 7.3126 55.0768 0.7092 0.2926 0.3562 5.7801 3.9214 1.1683 1.3450 25.7876 4.0704 1.7284 7.2556 29.4216 6.7614 5.6973 10.2539 31.2035 1.8089 3.0531 0.4595 8.0508 1.1990 0.8544 3.7645 4.9503 3.2248 2.0082 14.1460 12.4435 39.3804 18.3993 10.9064 3.2787 24.8703 0.4539 14.3788 7.4458 0.7057 24.2452 2.6928 3.9268 6.0855 4.2665 3.2617 2.2889 8.6975 1.3768 10.2646 3.6116 0.5496 1.4613 1.0255 2.1178 15.5499 10.8001 8.0322 1.9029 6.9805 1.2783 0.8647 13.7084 1.5160 8.7649 2.7250 0.5245 3.5477 0.2839 0.1874 3.7603 4.2273 42.2189 4.0799 21.8666 9.9189 2.3575 1.8396 0.8858 9.1124 12.9101 7.7306 14.7075 7.5462 6.1428 4.6846 3.2448 14.3685 6.4764 1.3032 8.4537 9.6706 12.6282 17.9814 8.8514 34.8268 20.6095 33.5337 43.2453 66.5547 21.5432 32.9157 22.3692 32.2560 18.3706 25.8055 12.0462 32.8828 29.1969 32.0111 73.4382 68.6947 51.4108 29.4699 22.6716 32.6400 35.1564 45.5130 33.7091 31.9520 32.9199 5.2958 3.6589 57.4481
temp: 298.150 k
press: 1.00000 atm
elementType: 8 7 7 6 6 6 6 6 6 6 6 6 6 6 6 6 6 6 6 6 6 6 6 6 1 1 1 1 1 1 1 1 1 1 1 1 1 1 1 1 1 1 1 1 1 1 1 1 1 1 1 1 1 1 1 1
symmnumber: 1
zpe: 1295468.9 jmol-1
zpe.correction: 0.493418 hartree
zpe.thermalcorrener: 0.515568 hartree
zpe.thermalcorrenthalpy: 0.516512 hartree
zpe.thermalcorrgfe: 0.445053 hartree
zpe.sumelectzpe: -1002.302025 hartree
zpe.sumelectthermal: -1002.279875 hartree
zpe.sumelectthermalent: -1002.278931 hartree
zpe.sumelectthermalfe: -1002.350390 hartree
dipole: -0.9179 1.8165 -0.7864
dipole: 2.1819
quadrupole: -179.0824 -138.1535 -147.7527
quadrupole: 19.2885 7.6673 0.2775
quadrupole: -24.0862 16.8427 7.2435 19.2885 7.6673 0.2775
hfenergy: -1002.7954432 hartree
pointgroup: C01 [X(C21H32N2O1)]
dipole: -0.3683455 0.7105287 -0.3104031 debye
polarizability: 285.8823163|-1.7978699|222.9316792|1.5049107|1.7498048|173.039162 unknown
InChI: InChI=1S/C21H32N2O/c1-19-11-13-12-22-23-18(13)10-14(19)4-5-15-16(19)6-8-20(2)17(15)7-9-21(20,3)24/h12,14-17,23-24H,4-11H2,1-3H3
charge 0 multiplicity 1
56 atoms
O  -5.530651 -1.24025 0.454566
N  5.63432 0.24104 -0.114063
N  6.070212 -1.076338 -0.250966
C  -2.426749 0.712932 -0.290976
C  -0.990286 0.97225 0.211592
C  -3.056695 -0.607144 0.254359
C  -0.081889 -0.243939 -0.168974
C  1.412468 -0.060724 0.302504
C  -4.517003 -0.509844 -0.348692
C  -2.171842 -1.786064 -0.216076
C  -0.704329 -1.606107 0.258667
C  1.948812 1.287848 -0.319394
C  -3.51906 1.782163 -0.025634
C  -0.414342 2.277164 -0.387537
C  -4.867383 1.009666 -0.208626
C  1.053866 2.501458 0.024583
C  2.270878 -1.247642 -0.26389
C  -3.16768 -0.611589 1.804959
C  1.539992 -0.047559 1.850466
C  3.427358 1.597112 0.059231
C  -4.635466 -0.995283 -1.81024
C  3.749479 -0.947862 -0.223407
C  4.253758 0.35537 -0.095547
C  4.901908 -1.789828 -0.316356
H  -2.344319 0.593777 -1.39619
H  -1.013365 1.080944 1.316209
H  -0.048736 -0.252222 -1.286062
H  -2.178576 -1.842704 -1.323372
H  -2.561392 -2.755165 0.161169
H  -0.661052 -1.71424 1.35842
H  -0.100037 -2.433248 -0.158879
H  1.914499 1.149571 -1.423347
H  -3.437952 2.64384 -0.711474
H  -3.427106 2.178043 1.004085
H  -1.031809 3.141072 -0.074153
H  -0.482196 2.221733 -1.495603
H  -5.536789 1.131335 0.660174
H  -5.42236 1.360098 -1.097087
H  1.455812 3.403629 -0.480301
H  1.107156 2.706349 1.113523
H  1.953792 -1.451344 -1.309253
H  2.056268 -2.169635 0.309816
H  -2.187565 -0.46462 2.288635
H  -3.84975 0.174487 2.169313
H  -3.578704 -1.574483 2.156137
H  2.600661 -0.008542 2.156399
H  1.021219 0.812449 2.309394
H  1.114388 -0.967182 2.290543
H  3.470758 1.972985 1.103294
H  3.798845 2.4201 -0.584364
H  -5.667344 -0.820755 -2.163277
H  -3.946615 -0.456158 -2.485274
H  -4.420899 -2.07747 -1.904271
H  -5.396709 -2.213803 0.318836
H  4.953991 -2.872292 -0.426379
H  6.332807 0.977319 -0.040606
