program: Gaussian 09
title: 000278557
version: EM64L-G09RevD.01
frameworkgroup: C1[X(C16H25NO2)]
method: RPBEPBE
basis: SDD
operation: Freq
keyword: #p
keyword: freq=noraman
keyword: PBEPBE/SDD
title: #p freq=noraman PBEPBE/SDD
converged: YES YES NO NO
title: Mulliken charges:
elementType: O O N C C C C C C C C C C C C C C C C H H H H H H H H H H H H H H H H H H H H H H H H H
charge: -0.284320 -0.259872 -0.316610 -0.053367 -0.429813 -0.353791 -0.347226 -0.717658 -0.358614 -0.368276 -0.299292 -0.696105 0.189278 0.220532 -0.342448 -0.338627 -0.219378 -0.217482 -0.222686 0.203240 0.186497 0.195136 0.179205 0.221869 0.185496 0.182095 0.246225 0.206075 0.215731 0.226814 0.194174 0.196674 0.217918 0.224935 0.238180 0.224824 0.209502 0.214827 0.208872 0.269990 0.271212 0.233139 0.231013 0.232114
chargesum: 0.00000
title: Mulliken charges with hydrogens summed into heavy atoms:
elementType: O O N C C C C C C C C C C C C C C C C
charge: -0.284320 -0.259872 -0.070385 0.149873 -0.048180 0.047282 0.020365 -0.069039 0.032235 0.074577 0.163712 -0.062903 0.189278 0.220532 -0.072458 -0.067415 0.013761 0.013531 0.009428
polarizability: 2.66157299e+02 4.57541062e+00 1.43781293e+02 -7.28300595e+00 1.62347039e+01 1.62341842e+02
1716.lowfreq: -18.5564 -4.1539 -0.0006 0.0006 0.0009 4.0080 13.0727 16.6175 23.7774
frequency: 5.6470 16.5254 23.7370 35.3581 42.2003 63.7673 67.8644 87.2600 103.8395 118.3372 130.7757 147.6236 155.7451 199.8933 203.4880 227.3382 230.8244 254.0754 275.9346 321.6076 328.1954 362.8835 403.4432 414.1279 438.3247 444.9167 479.5681 501.3391 533.5891 614.0747 654.6847 664.1809 679.4459 701.5301 723.4642 749.8849 754.6750 795.4400 812.9182 825.7359 852.7323 864.8403 890.3390 910.5118 925.6703 934.9855 954.6998 990.4045 995.1023 996.0376 1003.8515 1008.4492 1019.2582 1044.6242 1048.1887 1061.0294 1068.7127 1075.2062 1075.5616 1086.6162 1117.4182 1119.7112 1160.7086 1173.4668 1177.1389 1181.2503 1196.1837 1229.5159 1235.4507 1245.4067 1261.2190 1277.6882 1282.3725 1286.8544 1293.6887 1312.5624 1314.2999 1319.5891 1343.2685 1349.6066 1352.7450 1378.4006 1383.2968 1388.3858 1389.7692 1438.0519 1442.1846 1448.8769 1461.0393 1463.6313 1469.5268 1472.3580 1476.0000 1476.8003 1477.5390 1481.3366 1486.2266 1488.3962 1584.2450 1611.0599 1620.2807 2916.5977 2943.3487 2948.3553 2960.4010 2966.0070 2967.1918 2971.0202 2971.0995 2989.6069 3007.5777 3020.2166 3028.0615 3037.4661 3045.9381 3063.5322 3067.7655 3069.2347 3069.8444 3125.0162 3129.4712 3142.1255 3154.7953 3166.8491 3178.9825 3423.8277
redmass: 4.5902 4.2485 3.7075 3.3740 2.1857 4.6312 2.8034 2.9122 3.1401 2.1875 2.3370 2.9110 3.7118 1.7205 3.8216 1.1277 1.4722 3.3185 2.9486 4.4362 3.8911 3.3319 2.8258 3.5512 3.1097 3.7987 2.8595 3.3624 3.1505 6.4341 2.6559 2.3154 5.0733 1.6055 1.0686 1.1907 2.6369 2.1690 1.5823 1.2830 1.7841 1.2448 1.9710 2.6955 2.1493 1.3709 1.4213 6.2537 3.6793 1.3861 1.4446 1.3278 2.9639 2.5610 2.7392 2.3332 3.1967 1.4788 2.1224 1.7989 2.3242 3.2362 2.4320 1.0577 1.7586 1.1666 1.4785 1.4593 1.3211 3.5280 1.3236 1.0553 1.1988 1.2137 1.1548 1.2439 1.3060 1.3570 1.2543 1.5529 1.6851 1.2797 1.3069 1.2191 10.1710 2.2354 1.1456 1.1020 1.0949 1.0677 1.0706 1.0656 1.0429 1.0798 2.2601 1.0738 1.0863 1.0906 6.7740 6.1862 9.2612 1.0686 1.0638 1.0599 1.0659 1.0470 1.0575 1.0513 1.0557 1.0963 1.0948 1.1024 1.0693 1.0824 1.1016 1.0993 1.1007 1.0993 1.0992 1.1061 1.0855 1.0892 1.0939 1.0980 1.0975 1.0738
irintensity: 0.3021 0.0228 1.0248 0.3896 0.2321 1.5141 0.1513 0.3457 0.0847 0.1697 0.0851 0.6407 0.6994 0.9952 2.6920 0.0345 0.9348 0.4766 0.8690 21.1678 9.2751 1.4907 0.0079 2.2759 1.0477 0.6249 4.5825 8.3044 12.2239 0.6574 34.9576 59.7315 14.2698 97.0924 12.2078 1.6621 9.1290 22.5727 0.7231 4.6800 7.4109 0.0294 5.9615 27.1618 7.7365 1.8812 4.1268 1.4353 3.9137 0.0190 6.3208 0.4943 111.2756 24.5747 126.0209 2.6417 38.0836 36.5078 3.7290 42.0229 12.6469 59.9172 75.0033 0.2125 2.8678 37.8815 3.6419 8.1587 4.5878 308.4877 2.7381 6.2759 5.7714 5.9217 1.2646 0.4973 2.9975 5.5674 23.5824 1.4570 1.7784 15.8993 12.7976 11.3421 3.0529 15.3496 16.4315 28.7238 10.8066 1.0099 1.0856 1.0780 12.2958 13.5044 5.2142 2.8149 2.3085 21.1276 39.5805 10.6634 142.3056 65.6974 3.0186 18.2651 1.3679 24.9344 30.5918 96.7930 60.9634 8.1126 19.1464 6.7524 28.2808 20.8061 62.1968 52.4726 100.3335 62.1881 56.1216 14.1115 0.2409 11.8975 16.8828 21.9958 8.3297 0.3581
temp: 298.150 k
press: 1.00000 atm
elementType: 8 8 7 6 6 6 6 6 6 6 6 6 6 6 6 6 6 6 6 1 1 1 1 1 1 1 1 1 1 1 1 1 1 1 1 1 1 1 1 1 1 1 1 1
symmnumber: 1
zpe: 995490.2 jmol-1
zpe.correction: 0.379162 hartree
zpe.thermalcorrener: 0.400577 hartree
zpe.thermalcorrenthalpy: 0.401522 hartree
zpe.thermalcorrgfe: 0.323417 hartree
zpe.sumelectzpe: -828.421229 hartree
zpe.sumelectthermal: -828.399814 hartree
zpe.sumelectthermalent: -828.398870 hartree
zpe.sumelectthermalfe: -828.476974 hartree
dipole: 0.4155 0.4575 -1.6235
dipole: 1.7372
quadrupole: -100.0488 -117.6043 -115.4404
quadrupole: -3.2977 -4.7398 1.4798
quadrupole: 10.9823 -6.5731 -4.4092 -3.2977 -4.7398 1.4798
hfenergy: -828.8003913 hartree
pointgroup: C01 [X(C16H25N1O2)]
dipole: 0.1594984 -0.3423246 0.5696557 debye
polarizability: 265.8111918|-9.8290338|137.4085642|5.1824229|9.4227163|169.0606784 unknown
InChI: InChI=1S/C16H25NO2/c1-3-4-6-9-14(2)17-12-13-19-16(18)15-10-7-5-8-11-15/h5,7-8,10-11,14,17H,3-4,6,9,12-13H2,1-2H3
charge 0 multiplicity 1
44 atoms
O  1.60335 0.58195 0.415167
O  2.129385 0.106341 -1.809993
N  -1.895555 -0.631752 -0.285106
C  -2.836735 -1.67588 0.201995
C  -4.281542 -1.281944 -0.191531
C  -4.789423 0.010126 0.484248
C  -6.190177 0.437916 -0.007453
C  -2.493447 -3.106417 -0.296831
C  -6.71988 1.7114 0.690968
C  -0.488843 -0.740452 0.146199
C  0.161427 0.650985 0.041489
C  -8.114649 2.140901 0.186547
C  2.496574 0.280732 -0.619967
C  3.907544 0.206314 -0.140129
C  4.920443 -0.068378 -1.095819
C  4.252636 0.395477 1.223536
C  6.268235 -0.152386 -0.691399
C  5.603012 0.309787 1.623398
C  6.61186 0.036062 0.668994
H  -2.767057 -1.667451 1.310239
H  -4.330069 -1.168432 -1.296979
H  -4.957502 -2.123791 0.061083
H  -4.817972 -0.142227 1.583944
H  -4.057047 0.819731 0.300126
H  -6.156766 0.610966 -1.104035
H  -6.911574 -0.391463 0.152852
H  -1.97641 -0.506918 -1.304817
H  -2.598766 -3.171929 -1.39732
H  -3.170237 -3.856008 0.154876
H  -1.456521 -3.387816 -0.036074
H  -6.758815 1.536112 1.785686
H  -5.997247 2.53827 0.535064
H  -0.472264 -1.073259 1.200693
H  0.118774 -1.466686 -0.440298
H  -0.28718 1.35319 0.759671
H  0.077914 1.044479 -0.987589
H  -8.094579 2.353133 -0.899255
H  -8.470601 3.051786 0.702442
H  -8.861142 1.342031 0.357205
H  4.628597 -0.211134 -2.141554
H  3.462644 0.607183 1.949226
H  7.048778 -0.363706 -1.430201
H  5.87054 0.455597 2.675597
H  7.659587 -0.029838 0.983506
