program: Gaussian 09
title: 000278528
version: EM64L-G09RevD.01
frameworkgroup: C1[X(C9H11N)]
method: RPBEPBE
basis: SDD
operation: Freq
keyword: #pfreq=noraman
keyword: PBEPBE/SDD
title: #p freq=noraman PBEPBE/SDD
converged: YES YES NO NO
title: Mulliken charges:
elementType: N C C C C C C C C C H H H H H H H H H H H
charge: -0.021299 -0.598432 0.398545 -0.537214 -0.284676 -0.019925 -0.019195 -0.286504 -0.574130 -0.576501 0.218345 0.235282 0.244690 0.217718 0.249339 0.239186 0.236358 0.222180 0.215296 0.221566 0.219371
chargesum: 0.00000
title: Mulliken charges with hydrogens summed into heavy atoms:
elementType: N C C C C C C C C C
charge: -0.021299 -0.144805 0.398545 -0.074806 -0.035337 0.219261 0.217163 -0.286504 -0.136654 -0.135564
polarizability: 1.30371716e+02 1.15230239e+01 1.07561195e+02 -1.09011488e+01 -5.40450753e+00 7.29792904e+01
1716.lowfreq: -7.9851 -4.8202 0.0009 0.0010 0.0011 2.3914 29.9532 47.1131 62.9030
frequency: 29.8882 47.1013 62.8819 74.2143 118.2548 148.1632 180.7838 265.0223 336.4873 344.8639 377.1796 405.5692 462.2908 572.1473 604.7482 646.2969 695.1472 761.8235 861.7890 892.7245 919.6590 932.8288 939.7128 950.3152 952.3288 1004.8627 1006.7431 1050.0743 1106.8699 1114.5607 1168.3446 1205.1799 1233.6514 1274.8364 1282.6629 1289.6539 1293.5911 1346.4705 1422.0320 1428.2872 1453.4706 1454.3314 1636.3163 1654.5268 1660.3325 2158.6567 2967.2543 2977.6417 3036.9809 3054.4895 3087.2168 3087.8553 3103.3523 3105.2026 3110.0728 3198.6644 3198.7604
redmass: 3.4107 4.2584 2.7693 2.7222 3.0769 3.0938 2.6769 3.8379 3.1259 3.6874 2.3290 2.4058 2.1319 1.8873 2.8002 2.0554 3.3397 3.1358 1.5071 1.5436 1.5141 1.9783 1.7469 1.3736 1.4288 1.1299 1.1421 2.0790 1.6789 2.7223 2.3414 1.3046 1.4043 1.4034 1.2703 1.2517 1.2340 1.4460 1.1844 1.1794 1.0911 1.0926 6.9332 4.8397 4.7749 12.6289 1.0642 1.0587 1.1004 1.0959 1.0609 1.0608 1.0937 1.0942 1.0908 1.1144 1.1144
irintensity: 0.1279 1.8691 0.6207 0.5987 2.4172 1.4185 0.2218 0.5028 0.3651 0.9708 0.7868 1.2476 2.2750 9.5392 14.3653 10.6102 9.2241 5.2162 8.3523 19.3950 3.3000 17.1607 1.4746 114.1906 50.5158 21.9699 5.0920 5.9603 2.0359 18.5448 4.9979 0.6159 3.3411 0.2961 2.4174 1.2485 0.5462 0.4203 4.2170 6.9643 15.5579 16.5933 15.9204 10.3440 12.3099 21.8686 19.4567 15.5952 7.1206 8.4654 12.3325 12.2686 10.0650 7.8691 14.5038 17.6795 30.8210
temp: 298.150 k
press: 1.00000 atm
elementType: 7 6 6 6 6 6 6 6 6 6 1 1 1 1 1 1 1 1 1 1 1
symmnumber: 1
zpe: 447135.2 jmol-1
zpe.correction: 0.170305 hartree
zpe.thermalcorrener: 0.181802 hartree
zpe.thermalcorrenthalpy: 0.182747 hartree
zpe.thermalcorrgfe: 0.131064 hartree
zpe.sumelectzpe: -403.485250 hartree
zpe.sumelectthermal: -403.473752 hartree
zpe.sumelectthermalent: -403.472808 hartree
zpe.sumelectthermalfe: -403.524490 hartree
dipole: -0.7910 -3.3851 1.7261
dipole: 3.8812
quadrupole: -56.8422 -70.1287 -58.8791
quadrupole: -2.1022 -0.8531 3.0391
quadrupole: 5.1078 -8.1787 3.0709 -2.1022 -0.8531 3.0391
hfenergy: -403.6555544 hartree
pointgroup: C01 [X(C9H11N1)]
dipole: -0.2480118 1.0741603 -1.056575 debye
dipolederiv: -0.2482509 0.0249332 -0.0184943 0.0712728 -0.3369414 0.0487504 -0.0808335 0.081176 -0.2924864 0.016226 0.006784 -0.0787774 -0.0654587 0.0528485 0.0152804 -0.1630531 0.0419093 0.0697528 0.1582397 0.1232519 -0.0848969 0.145473 0.0262671 -0.0114492 -0.1943342 -0.0660035 -0.0337333 -0.1938719 0.0856827 0.0313063 0.1787915 0.0171342 -0.0006106 0.0017406 0.0160873 0.1143928 0.356784 -0.1864205 0.0684478 0.0758407 -0.1204854 -0.1328392 -0.0219793 -0.1159956 -0.0446152 -0.0539572 0.1389154 0.1626595 0.1290655 0.1211425 -0.0455998 0.3738425 0.0475594 0.0791527 0.0188486 -0.1348933 0.0887985 -0.4194031 0.1313643 0.1140657 0.0357634 0.184596 0.0393816 -0.077913 -0.0840329 0.0763994 -0.1339344 0.1893055 -0.1047673 0.1843833 -0.1541019 0.1296194 -0.3604915 0.0260773 0.173542 -0.0026211 -0.1535073 -0.1101485 0.1204148 -0.110457 0.0078759 -0.2487497 -0.040552 0.1214462 0.0079513 -0.1636261 0.2137832 0.1529375 0.200816 -0.0833333 0.0234719 -0.006123 -0.0461464 -0.0091811 -0.0111627 0.1301155 -0.0287531 0.0663641 -0.036334 -0.0298356 0.0255799 0.0330044 0.0446083 -0.0505536 -0.0971467 0.0247871 -0.0788824 0.0608077 0.0684692 0.0582587 -0.0162561 0.0389602 -0.0305448 0.072403 0.057052 0.0721594 0.0159243 -0.0590148 -0.0363219 -0.097664 -0.0392694 0.0815746 -0.0402682 -0.030379 -0.0970078 -0.0345976 0.0515426 -0.0113561 0.0238979 -0.0647414 0.0185193 0.1097428 0.0381208 0.0912716 0.0212971 0.1394185 -0.0201681 -0.0519452 -0.0047751 0.0097294 0.0963348 -0.0881482 0.0573589 -0.0316427 0.0624575 -0.0114166 -0.0978163 0.0517555 0.0374482 -0.0886103 -0.0583073 -0.1073453 -0.0221792 0.0957 -0.07649 -0.11973 -0.1122925 0.0590297 -0.0253094 -0.1447618 -0.0429059 0.0053208 0.1366692 0.0063031 -0.0877928 -0.010709 0.0418502 0.0842262 -0.0574814 0.1186439 -0.0332419 0.0587932 0.1040287 0.0012565 0.1479865 -0.001892 -0.104946 -0.0156074 -0.1043225 0.0814815 0.0854641 0.0079594 -0.0812391 -0.0293196 0.0824998 -0.1230067 -0.1054038 -0.1009201 -0.0128429 unknown
polarizability: 129.0880876|-8.2398333|101.8334048|14.7097755|-15.0496611|79.9907093 unknown
InChI: InChI=1S/C9H11N/c1-3-5-7-9(8-10)6-4-2/h3-4,7H,1-2,5-6H2
charge 0 multiplicity 1
21 atoms
N  0.674539 -2.492361 1.589511
C  1.911174 -0.131239 -0.786932
C  0.554592 -0.600413 -0.24894
C  -2.016923 -0.482256 -0.183826
C  -0.639476 -0.085068 -0.675519
C  2.783836 0.498774 0.287784
C  -2.748329 0.702636 0.434366
C  0.595167 -1.634066 0.757733
C  3.310175 1.745532 0.214976
C  -3.91434 1.219681 -0.026887
H  1.744256 0.587411 -1.609271
H  2.443773 -1.005197 -1.216318
H  -1.930061 -1.301275 0.556131
H  -2.612129 -0.867813 -1.035229
H  -0.612159 0.710592 -1.433572
H  2.988889 -0.127246 1.168743
H  -2.26634 1.148926 1.316721
H  3.942038 2.146381 1.015159
H  3.127238 2.401507 -0.645424
H  -4.397005 2.071293 0.465208
H  -4.423114 0.802001 -0.904814
