program: Gaussian 09
title: 000278539
version: EM64L-G09RevD.01
frameworkgroup: C1[X(C10H24N2)]
method: RPBEPBE
basis: SDD
operation: Freq
keyword: #pfreq=noraman
keyword: PBEPBE/SDD
title: #p freq=noraman PBEPBE/SDD
converged: YES YES NO NO
title: Mulliken charges:
elementType: N N C C C C C C C C C C H H H H H H H H H H H H H H H H H H H H H H H H
charge: -0.314249 -0.330077 -0.047114 -0.037998 -0.352021 -0.349541 -0.381281 -0.343562 -0.737153 -0.705459 -0.689632 -0.698349 0.227883 0.218240 0.209353 0.177372 0.179547 0.179975 0.234485 0.232387 0.190887 0.206659 0.175503 0.210481 0.212881 0.204127 0.225642 0.235346 0.195618 0.202312 0.208564 0.212241 0.213897 0.210026 0.207974 0.215035
chargesum: 0.00000
title: Mulliken charges with hydrogens summed into heavy atoms:
elementType: N N C C C C C C C C C C
charge: -0.079764 -0.097690 0.180769 0.180242 0.034704 0.009981 0.016266 0.042422 -0.094502 -0.072183 -0.054930 -0.065314
polarizability: 1.45946389e+02 3.75220432e+00 1.27706099e+02 7.41586170e-01 -3.77086653e-01 1.05943370e+02
1716.lowfreq: -19.1052 -6.7965 -3.2695 -0.0007 -0.0006 -0.0005 14.1164 38.8330 52.9979
frequency: 12.5403 38.6865 52.8196 62.8819 67.4734 104.0125 109.4945 151.4426 173.5929 199.6939 220.2161 226.5064 232.4861 239.1307 253.5445 288.4847 312.6210 351.0002 377.2480 436.7622 467.4276 497.9825 558.2900 610.2061 705.6353 733.8181 738.3812 810.6938 834.8548 849.0748 856.0432 886.2515 897.3341 940.9272 945.9795 989.8399 998.0159 1019.3655 1033.2826 1047.5882 1071.5587 1114.7372 1123.1006 1130.5862 1146.3875 1155.3292 1173.4917 1177.2514 1227.9494 1249.5182 1257.6669 1273.7614 1281.2592 1296.0344 1304.1086 1304.6556 1322.3654 1337.3192 1344.5430 1354.5250 1367.9681 1381.5188 1389.8563 1390.3137 1418.9328 1449.1533 1452.6740 1462.9667 1467.4102 1469.1143 1472.2571 1474.1671 1476.1090 1477.2039 1481.5722 1483.7004 1485.3721 1493.3955 2939.8312 2964.1113 2966.5541 2969.1315 2970.5629 2971.9613 2972.9599 2973.8421 2991.1136 3010.0061 3013.2041 3019.1411 3029.8669 3039.4211 3064.7668 3064.9773 3067.8099 3068.6778 3069.7778 3070.7082 3072.5787 3094.8781 3329.2242 3340.6566
redmass: 2.8906 2.9910 2.0636 2.1028 1.7830 2.6009 2.7707 2.6104 2.2973 1.2778 1.1038 1.2332 1.1238 2.6876 1.7869 2.4966 2.8533 2.5633 2.3778 2.1221 2.3487 3.0532 2.1825 1.6495 2.3221 1.1278 1.1548 2.1134 1.7461 1.2761 1.3420 1.7147 1.6650 1.8319 1.7395 1.5227 1.3355 1.3677 2.3478 2.7272 2.7185 2.7148 2.4518 2.2201 2.1252 2.1229 2.8598 2.2786 1.3529 1.2886 1.2481 1.5687 1.1304 1.1245 1.3765 1.3743 1.2264 1.2724 1.6036 1.4790 1.2345 1.2260 1.2121 1.2142 1.1259 1.0798 1.0779 1.0625 1.0690 1.0655 1.0587 1.0527 1.0435 1.0429 1.0650 1.0667 1.0729 1.1581 1.0604 1.0548 1.0600 1.0395 1.0388 1.0388 1.0385 1.0571 1.0929 1.0937 1.0889 1.0899 1.0985 1.1022 1.0985 1.0981 1.0997 1.1003 1.0997 1.0994 1.0998 1.0995 1.0723 1.0753
irintensity: 0.1807 0.0783 0.5122 0.4970 0.1931 0.6573 0.8589 0.6092 4.0284 2.5697 0.2240 0.0200 0.1194 4.3708 13.7597 0.1394 0.4288 1.1586 4.8112 19.5825 7.5859 4.6921 48.2846 14.6311 113.0264 14.1965 5.7366 21.2438 2.1201 0.6184 4.0794 7.9931 4.3574 7.0931 1.6712 2.9042 3.0099 4.0180 3.8486 1.5172 1.6265 8.9558 5.2779 9.9594 10.1469 16.0793 3.2551 44.1152 1.9467 3.9261 1.4248 4.2758 0.2822 2.3707 4.4713 1.1426 9.1054 3.5694 5.9949 0.9509 27.9073 16.4822 11.8246 9.1045 4.7854 5.3147 1.1208 12.0244 13.0136 5.6205 5.1393 5.7854 15.3514 10.4676 6.3478 9.9415 16.6131 3.8989 30.8441 12.3726 69.5103 32.3619 30.2206 27.8898 42.9555 57.8305 28.1228 8.9010 14.9700 2.6134 26.5458 34.5242 41.1977 27.8523 89.8423 85.0293 64.2472 34.2522 84.8546 38.0585 29.4143 11.8634
temp: 298.150 k
press: 1.00000 atm
elementType: 7 7 6 6 6 6 6 6 6 6 6 6 1 1 1 1 1 1 1 1 1 1 1 1 1 1 1 1 1 1 1 1 1 1 1 1
symmnumber: 1
zpe: 862191.9 jmol-1
zpe.correction: 0.328392 hartree
zpe.thermalcorrener: 0.345230 hartree
zpe.thermalcorrenthalpy: 0.346174 hartree
zpe.thermalcorrgfe: 0.282260 hartree
zpe.sumelectzpe: -503.888599 hartree
zpe.sumelectthermal: -503.871761 hartree
zpe.sumelectthermalent: -503.870817 hartree
zpe.sumelectthermalfe: -503.934731 hartree
dipole: -0.0576 0.6052 1.0736
dipole: 1.2337
quadrupole: -76.7414 -81.0178 -77.5574
quadrupole: -0.5425 0.0590 -0.2699
quadrupole: 1.6974 -2.5789 0.8815 -0.5425 0.0590 -0.2699
hfenergy: -504.216991 hartree
pointgroup: C01 [X(C10H24N2)]
dipole: -0.1239331 0.4637658 -0.0718734 debye
polarizability: 140.4429735|4.4174803|108.6565104|-8.1881423|-8.0575082|130.4963745 unknown
InChI: InChI=1S/C10H24N2/c1-5-7-9(3)11-12-10(4)8-6-2/h9-12H,5-8H2,1-4H3
charge 0 multiplicity 1
36 atoms
N  0.454468 -0.237451 0.307718
N  -0.319674 -0.329038 1.511217
C  1.926225 -0.281434 0.538593
C  -1.530672 -1.189765 1.441855
C  2.649762 -0.457326 -0.822611
C  -2.803083 -0.489808 0.876333
C  2.504466 0.707851 -1.832724
C  -2.664795 0.089724 -0.550624
C  2.461483 0.922191 1.360552
C  -1.810666 -1.757867 2.851724
C  3.271231 0.429043 -3.144785
C  -4.002687 0.63356 -1.098012
H  2.097603 -1.199175 1.132497
H  -1.245987 -2.014914 0.762338
H  2.266189 -1.384966 -1.291285
H  3.729101 -0.61788 -0.622049
H  -3.10627 0.320662 1.57545
H  -3.635165 -1.225378 0.881473
H  0.186048 0.552915 -0.303323
H  -0.492256 0.569073 1.994137
H  1.433992 0.870474 -2.073542
H  2.87799 1.649537 -1.384599
H  -1.917389 0.908912 -0.549306
H  -2.2688 -0.692061 -1.228027
H  3.550072 0.831692 1.536692
H  2.279748 1.882867 0.841875
H  1.963063 0.958298 2.346712
H  -0.926293 -2.30201 3.223854
H  -2.038225 -0.944321 3.56837
H  -2.676676 -2.445443 2.839379
H  4.351164 0.289096 -2.947815
H  2.897972 -0.492161 -3.630406
H  3.163198 1.260705 -3.865325
H  -4.762838 -0.168821 -1.150482
H  -4.404672 1.431158 -0.444397
H  -3.885424 1.055062 -2.113554
