program: Gaussian 09
title: 000278548
version: EM64L-G09RevD.01
frameworkgroup: C1[X(C12H28N2)]
method: RPBEPBE
basis: SDD
operation: Freq
keyword: #pfreq=noraman
keyword: PBEPBE/SDD
title: #p freq=noraman PBEPBE/SDD
converged: YES YES NO NO
title: Mulliken charges:
elementType: N N C C C C C C C C C C C C H H H H H H H H H H H H H H H H H H H H H H H H H H H H
charge: -0.324687 -0.324910 -0.021408 -0.021270 -0.432793 -0.432856 0.008935 0.008976 -0.729929 -0.729897 -0.733554 -0.726171 -0.733500 -0.726263 0.230947 0.230823 0.185716 0.195409 0.185683 0.195468 0.182982 0.182960 0.234056 0.234114 0.197320 0.213849 0.225020 0.197306 0.213821 0.225104 0.207813 0.206390 0.233013 0.197394 0.247198 0.202556 0.207810 0.206378 0.233022 0.197388 0.247200 0.202584
chargesum: 0.00000
title: Mulliken charges with hydrogens summed into heavy atoms:
elementType: N N C C C C C C C C C C C C
charge: -0.090631 -0.090795 0.209540 0.209553 -0.051668 -0.051705 0.191917 0.191937 -0.093739 -0.093666 -0.086339 -0.079024 -0.086290 -0.079090
polarizability: 1.61606126e+02 3.30192607e-01 1.46203590e+02 2.90974945e-03 -1.09696150e-03 1.35665258e+02
1716.lowfreq: -12.5212 -12.0190 -0.0007 -0.0005 -0.0004 9.9296 23.9146 39.0044 47.5308
frequency: 23.8296 38.7791 47.1070 52.9150 70.8577 110.9607 115.4907 149.2022 195.0763 200.3325 220.3391 223.9081 225.4409 233.2006 233.7508 268.7380 269.8783 287.1754 298.7073 350.4954 351.7623 362.2328 379.6710 413.2682 413.7871 463.4297 466.7961 573.2802 575.7510 630.5503 718.1226 770.6850 778.5283 834.4909 842.7333 870.5698 871.8718 913.2067 914.3230 915.5218 916.5956 957.8515 957.8583 977.3631 977.5944 1028.7715 1032.9691 1036.8022 1044.2708 1098.4548 1104.0325 1118.7499 1156.5426 1157.2646 1164.7804 1175.1476 1197.3184 1197.7019 1235.6228 1240.1117 1293.9036 1296.0027 1306.8400 1308.0181 1333.3703 1334.5195 1337.4135 1338.9310 1356.5039 1356.6392 1367.4466 1368.9438 1369.8730 1370.6720 1386.9629 1389.4265 1410.7956 1448.2278 1451.6065 1460.1891 1462.8138 1463.0718 1466.7125 1473.2858 1475.7376 1477.2351 1481.8550 1485.4080 1486.7276 1488.2903 1496.4331 1496.8811 2937.0325 2937.0606 2951.6070 2951.7104 2960.6799 2961.1170 2965.0044 2965.1610 2970.7661 2970.8513 3002.7631 3002.7987 3022.9894 3023.7309 3052.5385 3052.6321 3059.5828 3060.4669 3062.7205 3063.3288 3070.0086 3070.0559 3071.6777 3071.8305 3083.6586 3083.8163 3298.6750 3309.7505
redmass: 3.4058 2.8663 2.8057 3.1939 3.0317 2.7190 2.2458 2.6429 2.3720 2.4542 1.5721 1.0668 1.4265 1.1867 1.2101 1.0652 1.0452 2.5301 2.5000 1.9537 1.9230 2.2739 2.1097 2.5995 2.3544 2.2724 2.2715 2.2684 2.4409 1.7408 2.4432 2.7782 2.4334 1.5876 1.7108 1.5482 1.7242 1.4302 1.4342 1.4248 1.4064 1.4163 1.4144 1.9297 1.9055 1.6087 1.5551 1.9105 2.1314 1.9089 1.8352 2.9663 2.0693 2.1670 2.5234 2.2580 1.9325 1.9807 1.3399 1.3643 1.2825 1.2935 1.5201 1.5382 1.3407 1.3077 1.3425 1.3623 1.3812 1.3865 1.2310 1.2310 1.2393 1.2420 1.2158 1.2225 1.1192 1.0923 1.0812 1.0715 1.0456 1.0455 1.0586 1.0835 1.0532 1.0528 1.0538 1.0685 1.0496 1.1014 1.0539 1.0547 1.0687 1.0687 1.0734 1.0730 1.0367 1.0367 1.0368 1.0370 1.0379 1.0381 1.0936 1.0935 1.0879 1.0883 1.0991 1.0991 1.0983 1.0980 1.0988 1.0986 1.0993 1.0993 1.0999 1.0998 1.0992 1.0992 1.0720 1.0756
irintensity: 0.0114 0.0528 0.0937 0.0827 0.3704 0.1794 0.5463 0.0375 10.9675 1.9217 0.1074 1.1793 0.0371 0.0063 1.3864 0.0455 0.0478 0.0033 0.1033 0.0266 0.2718 0.1085 1.1081 0.2433 3.4079 0.3262 21.3343 0.4756 27.0362 25.8799 87.6258 0.1188 30.2266 0.0086 21.2399 12.5433 0.8456 3.9206 0.8121 1.3568 8.1006 0.1734 0.1222 15.3980 4.1314 0.7344 4.1596 0.0362 10.7012 0.1249 2.9691 7.3010 25.1727 0.2737 9.2544 33.0542 3.6273 9.2212 0.0580 1.6355 1.4685 7.1572 8.9102 1.2038 0.2409 10.8892 7.2124 1.6980 2.4389 8.7545 14.7720 22.8644 34.3088 7.7190 11.6157 20.2512 0.4067 5.6229 4.0247 3.4523 5.7406 0.6141 1.6180 13.0335 8.2381 0.0832 9.1565 5.7114 0.2574 17.1883 11.8235 16.3484 11.3517 26.4082 95.4737 8.1675 58.9087 34.1408 90.5268 47.6584 8.6369 18.4086 44.2854 8.1589 2.8796 26.2314 7.5975 47.3328 12.0778 114.9439 2.7693 129.1980 60.1736 10.9781 18.8835 57.9449 88.3248 5.7615 34.1460 11.9273
temp: 298.150 k
press: 1.00000 atm
elementType: 7 7 6 6 6 6 6 6 6 6 6 6 6 6 1 1 1 1 1 1 1 1 1 1 1 1 1 1 1 1 1 1 1 1 1 1 1 1 1 1 1 1
symmnumber: 1
zpe: 1008017.2 jmol-1
zpe.correction: 0.383933 hartree
zpe.thermalcorrener: 0.403016 hartree
zpe.thermalcorrenthalpy: 0.403960 hartree
zpe.thermalcorrgfe: 0.336624 hartree
zpe.sumelectzpe: -582.334170 hartree
zpe.sumelectthermal: -582.315087 hartree
zpe.sumelectthermalent: -582.314143 hartree
zpe.sumelectthermalfe: -582.381479 hartree
dipole: 0.0011 0.0014 -1.4064
dipole: 1.4064
quadrupole: -90.9975 -93.2991 -89.2496
quadrupole: -2.9521 -0.0007 -0.0028
quadrupole: 0.1846 -2.1170 1.9324 -2.9521 -0.0007 -0.0028
hfenergy: -582.7181031 hartree
pointgroup: C01 [X(C12H28N2)]
dipole: 0.0016195 0.5533208 0.0000958 debye
polarizability: 161.3870521|-0.0589904|135.6654031|1.8529398|0.0062951|146.4225193 unknown
InChI: InChI=1S/C12H28N2/c1-9(2)7-11(5)13-14-12(6)8-10(3)4/h9-14H,7-8H2,1-6H3
charge 0 multiplicity 1
42 atoms
N  -0.701366 0.896343 -0.150248
N  0.705321 0.892507 0.148938
C  -1.555078 0.463071 0.990797
C  1.556793 0.454163 -0.991851
C  -3.033875 0.346107 0.540541
C  3.035172 0.33113 -0.541805
C  -3.380808 -0.687342 -0.575777
C  3.377826 -0.701121 0.576988
C  -1.437052 1.394818 2.227155
C  1.44265 1.385014 -2.229256
C  -2.685122 -2.050585 -0.349124
C  -3.102099 -0.161417 -2.005912
C  2.676708 -2.062118 0.353664
C  3.101371 -0.17066 2.005868
H  -1.180898 -0.536475 1.278587
H  1.178027 -0.543981 -1.278482
H  -3.396902 1.349978 0.227455
H  -3.614463 0.085019 1.44923
H  3.402977 1.334013 -0.231123
H  3.614259 0.065231 -1.450053
H  -4.477535 -0.855449 -0.499764
H  4.473856 -0.873897 0.501332
H  -1.044255 1.785102 -0.559761
H  1.053116 1.779265 0.558651
H  -1.833479 2.405011 2.001576
H  -2.007098 0.992194 3.085492
H  -0.381243 1.489837 2.540408
H  1.843692 2.393684 -2.005042
H  2.010635 0.978754 -3.087245
H  0.387202 1.484411 -2.542357
H  -2.870378 -2.438098 0.670993
H  -3.056837 -2.802505 -1.070291
H  -1.593052 -1.956944 -0.49146
H  -3.624722 0.797879 -2.188246
H  -2.019557 -0.001322 -2.148406
H  -3.455862 -0.886059 -2.764267
H  2.860225 -2.452726 -0.665587
H  3.045659 -2.813797 1.076497
H  1.585019 -1.964104 0.496023
H  3.628088 0.786834 2.185903
H  2.019546 -0.005474 2.147891
H  3.452039 -0.894989 2.765969
