program: Gaussian 09
title: 000278522
version: EM64L-G09RevD.01
frameworkgroup: C1[X(C10H8Br3NO)]
method: RPBEPBE
basis: SDD
operation: Freq
keyword: #p
keyword: freq=noraman
keyword: PBEPBE/SDD
title: #p freq=noraman PBEPBE/SDD
converged: YES YES NO NO
title: Mulliken charges:
elementType: Br Br Br O N C C C C C C C C C C H H H H H H H H
charge: 0.040150 0.056833 0.049154 -0.211723 -0.474358 0.682070 -0.363810 -0.326383 0.201167 -0.563375 -0.157638 -0.158037 -0.229652 -0.074857 -0.558040 0.339972 0.247393 0.251083 0.277816 0.277281 0.243933 0.226514 0.224508
chargesum: 0.00000
title: Mulliken charges with hydrogens summed into heavy atoms:
elementType: Br Br Br O N C C C C C C C C C C
charge: 0.040150 0.056833 0.049154 -0.211723 -0.134386 0.682070 -0.363810 -0.326383 0.201167 -0.064899 0.120177 0.119244 -0.229652 0.169076 -0.107019
polarizability: 2.36265877e+02 7.71089510e+00 1.89093953e+02 -5.57431514e+00 -5.42947198e+00 8.85825236e+01
1716.lowfreq: -2.8455 -1.3041 0.0002 0.0005 0.0006 6.1821 24.6206 30.9973 54.9318
frequency: 24.5698 30.9836 54.9186 71.3141 79.4337 101.8320 111.1835 123.6285 140.7175 174.8478 178.7105 220.7766 260.1904 295.1318 344.7721 357.1914 379.1872 416.8466 493.5052 502.2675 534.1679 554.5297 578.6878 611.1140 652.7614 691.8841 708.0694 745.3372 853.3226 864.8651 877.6953 900.7338 914.8836 960.4660 965.3634 1016.3797 1039.0321 1096.4723 1103.7565 1171.8214 1186.1858 1226.6743 1265.2156 1278.0153 1295.2092 1331.4989 1358.7111 1422.8259 1429.6064 1443.0500 1457.7900 1538.0248 1565.2945 1636.6604 1653.0624 2999.8814 3062.7749 3086.4965 3101.7513 3186.8599 3188.9440 3198.1865 3472.1515
redmass: 5.3194 8.2249 4.9321 4.4635 3.6221 9.1863 36.6395 17.4474 5.4788 4.5030 4.5700 64.0607 6.7347 4.6258 7.7300 7.1468 2.7056 3.1912 4.8804 4.9928 2.8797 3.9810 1.3863 2.5489 3.1163 4.3751 8.9407 4.7125 5.2261 1.4450 1.3798 1.6441 3.9120 1.3379 2.5330 1.1500 5.1528 2.5423 1.6833 2.6064 1.7477 1.4529 2.1840 1.3273 1.2683 3.9376 4.5832 1.1487 2.6512 1.2091 2.0737 7.5969 8.4398 6.4841 5.1350 1.0613 1.0981 1.0610 1.0938 1.0932 1.0939 1.1145 1.0766
irintensity: 0.9447 0.3326 0.7931 0.1904 5.2642 1.5577 0.1368 0.8989 0.8505 1.7447 0.5119 0.1296 0.8737 7.5420 3.2739 3.8253 0.9082 23.4650 1.0115 0.8321 1.6168 12.1314 43.2054 32.8569 4.2113 31.9092 79.0254 77.6750 9.1961 26.1781 3.4305 7.7242 1.4743 81.8895 7.8209 26.4672 1.0041 23.6106 6.9378 59.1622 27.9943 9.2616 20.0231 1.0934 1.2414 51.6427 27.5812 13.6818 63.4950 138.4949 390.1681 73.9849 53.4119 188.9213 20.6359 7.7609 2.1987 9.3799 7.2379 0.9467 0.2025 21.2501 75.3291
temp: 298.150 k
press: 1.00000 atm
elementType: 35 35 35 8 7 6 6 6 6 6 6 6 6 6 6 1 1 1 1 1 1 1 1
symmnumber: 1
zpe: 404267.3 jmol-1
zpe.correction: 0.153977 hartree
zpe.thermalcorrener: 0.169982 hartree
zpe.thermalcorrenthalpy: 0.170926 hartree
zpe.thermalcorrgfe: 0.106118 hartree
zpe.sumelectzpe: -555.115460 hartree
zpe.sumelectthermal: -555.099456 hartree
zpe.sumelectthermalent: -555.098512 hartree
zpe.sumelectthermalfe: -555.163319 hartree
dipole: 1.6915 1.7012 -2.8868
dipole: 3.7535
quadrupole: -103.2596 -112.6681 -122.5229
quadrupole: 4.2441 -5.8385 3.5902
quadrupole: 9.5573 0.1488 -9.7061 4.2441 -5.8385 3.5902
hfenergy: -555.2694375 hartree
pointgroup: C01 [X(C10H8Br3N1O1)]
dipole: 0.7253282 0.0975279 -1.2826489 debye
dipolederiv: -0.175835 -0.2363831 0.1061019 -0.2125282 -0.4464544 0.1953418 0.0981597 0.2097671 -0.0999014 -0.164897 0.2495073 -0.0882869 0.2447015 -0.4273356 0.2020673 -0.0992516 0.1694413 -0.0611642 -0.7851841 -0.0365449 -0.0373475 -0.0374482 -0.0504661 0.018525 -0.0358775 0.0230908 -0.0201868 -0.6211962 -0.0171903 0.2805085 -0.0408925 -0.2982347 0.0158345 -0.1628407 -0.052403 -1.0166276 -1.3777225 -0.1096869 -0.3910009 -0.0787004 -0.3615896 -0.1261472 -0.5381002 -0.0880175 -0.7502406 0.8421441 0.0593888 0.2121733 0.1163692 -0.3042099 0.2730372 -0.0268175 0.2045939 -0.0521419 0.2527888 0.3636466 -0.2003637 0.2998682 0.7441205 -0.4167574 -0.1964136 -0.4402619 0.0719245 0.2812815 -0.4029601 0.1244037 -0.3456337 0.7838284 -0.3622529 0.2873192 -0.3695093 0.0706616 1.4204873 0.1604607 0.0148124 0.0232645 0.1685277 -0.0723235 0.7520861 0.1563245 1.532211 -0.3365319 -0.0644873 0.1157277 -0.0832567 0.0704723 0.0286824 0.089037 -0.0227475 -0.0646038 -0.5494797 -0.1835927 0.0632663 -0.1740045 -0.2515249 0.0960126 0.0313434 0.1100346 -0.0897994 -0.5625034 0.1877414 -0.1121579 0.1440639 -0.2214401 0.0797337 -0.0800138 0.0851565 -0.0537974 1.3708599 0.0598416 0.0654365 0.06059 0.1478673 -0.1366757 0.0560235 -0.1404484 -0.0535859 -0.2413909 -0.0143335 -0.1392423 -0.0615463 0.1211899 0.0521291 -0.3223721 -0.011225 0.1906386 -0.4170788 -0.0008958 -0.101458 0.0009653 0.070343 0.1116839 -0.0689566 0.082293 -0.1536815 0.310965 -0.0257946 -0.0554145 0.0513812 0.2640168 0.1009532 -0.0627858 0.0235044 0.1509359 0.0512987 -0.0117603 0.0117016 -0.0199434 -0.0738601 -0.0546818 0.0619741 0.0212283 0.0744668 0.0409148 0.0147928 -0.0129086 0.0942222 0.0840481 0.0427905 -0.0006107 0.054155 -0.0427876 0.0739621 0.0295889 -0.0258732 0.0386958 0.0677794 0.0519155 -0.0154981 0.0558421 0.1305134 0.0773996 -0.0343135 0.0050801 -0.0410116 0.0548322 0.0463781 0.0103021 0.048497 0.1354323 0.1678884 -0.020036 0.0377808 0.0088647 -0.0993958 -0.0504656 0.0521139 -0.011428 0.0482379 0.157896 0.021167 0.0938259 0.0184709 0.052771 -0.0678137 0.1372443 -0.0545683 -0.0365365 0.1839332 0.0118441 0.0332348 -0.0064918 -0.0952852 -0.0279668 0.0339349 -0.0533197 0.0900326 unknown
polarizability: 235.621241|11.359359|162.9999626|0.4846707|-44.8391947|115.3211502 unknown
InChI: InChI=1S/C10H8Br3NO/c1-2-3-9(15)14-10-7(12)4-6(11)5-8(10)13/h2,4-5,14H,1,3H2
charge 0 multiplicity 1
23 atoms
Br -0.160231 2.56516 -1.449035
Br -0.042643 -2.724989 1.059131
Br -5.073785 -0.28126 -0.334207
O  1.308781 0.054558 2.292325
N  1.128228 0.059141 -0.043874
C  -0.286082 -0.042991 -0.119215
C  -1.063685 0.988416 -0.717498
C  -0.998335 -1.172582 0.374358
C  1.848335 0.12377 1.1580
C  3.366932 0.335316 0.967265
C  -2.467792 0.934992 -0.804373
C  -2.406402 -1.246092 0.333311
C  -3.122455 -0.186699 -0.256645
C  3.933312 -0.179003 -0.339104
C  4.452837 0.60321 -1.321155
H  1.652821 0.257794 -0.903182
H  3.560891 1.420336 1.074068
H  3.845836 -0.16175 1.83014
H  -3.02965 1.747813 -1.268602
H  -2.924385 -2.12007 0.733219
H  3.910998 -1.270409 -0.476743
H  4.854406 0.173054 -2.245381
H  4.504472 1.695083 -1.220702
