program: Gaussian 09
title: 000278592
version: EM64L-G09RevD.01
frameworkgroup: C1[X(C26H23Cl2N3O2)]
method: RPBEPBE
basis: SDD
operation: Freq
keyword: #p
keyword: freq=noraman
keyword: PBEPBE/SDD
title: #p freq=noraman PBEPBE/SDD
converged: NO YES NO NO
title: Mulliken charges:
elementType: Cl Cl O O N N N C C C C C C C C C C C C C C C C C C C C C C C C C C H H H H H H H H H H H H H H H H H H H H H H H
charge: -0.013034 -0.000658 -0.209046 -0.215669 -0.074610 -0.215653 -0.052822 -0.365704 -0.373323 -0.391964 -0.385219 -0.399809 -0.347454 -0.378716 0.120440 0.097782 -0.007088 0.089190 0.314326 0.088275 -0.103929 -0.372197 -0.328310 -0.322087 -0.242660 -0.223731 -0.316984 0.542357 -0.376980 -0.398429 -0.097596 -0.212826 -0.107483 0.215898 0.178211 0.169585 0.216254 0.193485 0.205605 0.204313 0.193356 0.215638 0.189482 0.204833 0.236304 0.251358 0.246251 0.287275 0.277590 0.269144 0.237575 0.237891 0.276878 0.264465 0.250010 0.260208
chargesum: 0.00000
title: Mulliken charges with hydrogens summed into heavy atoms:
elementType: Cl Cl O O N N N C C C C C C C C C C C C C C C C C C C C C C C C C C
charge: -0.013034 -0.000658 -0.209046 -0.215669 -0.074610 -0.215653 -0.052822 0.028405 0.012516 0.007126 0.012450 0.005311 0.093683 0.118893 0.120440 0.097782 -0.007088 0.089190 0.314326 0.088275 -0.103929 -0.084921 -0.050720 -0.052943 -0.005085 0.014160 -0.040107 0.542357 -0.112514 -0.148419 -0.097596 0.047382 -0.107483
polarizability: 5.77875362e+02 8.93191546e+01 4.89048056e+02 -1.63762031e+01 2.42735341e+01 1.59250727e+02
1716.lowfreq: -12.9783 -6.0224 -2.6014 -0.0005 0.0011 0.0014 3.9362 11.4863 14.3640
frequency: -11.4302 11.1673 14.1005 24.4460 29.6181 32.1180 58.1443 63.1276 84.5937 89.8199 105.6918 126.2344 130.4597 132.6841 139.8021 177.8789 179.4831 192.2791 200.3667 212.9108 229.5004 239.6413 260.9593 285.7781 298.0754 304.7958 324.9799 328.3920 351.3208 355.7497 372.8123 384.9117 392.0503 419.5066 435.9716 436.4161 443.2032 447.6623 457.5728 487.1029 509.6632 532.7738 546.6665 556.1706 574.4460 590.2355 611.3811 631.4496 638.5337 668.9481 675.4578 708.5268 732.9821 735.5399 736.4140 758.6256 764.6849 786.5445 786.9064 803.8050 811.7520 824.4041 838.2202 852.6555 855.2197 861.6044 877.7090 877.9004 891.9323 902.2147 924.8641 944.6953 956.1918 960.8231 981.3569 987.3780 994.8549 1000.4194 1005.4406 1014.8955 1015.7924 1038.2531 1047.5526 1055.1290 1067.7838 1103.4337 1108.0430 1116.3860 1122.4874 1138.6928 1144.5744 1150.0049 1155.8594 1162.0266 1175.0584 1211.2920 1226.9493 1245.2264 1257.9771 1263.0581 1264.6929 1272.4186 1281.7924 1294.8053 1298.5858 1307.4167 1312.0121 1322.3013 1329.7917 1331.1011 1337.5934 1339.5102 1346.2594 1350.8206 1359.3232 1368.4151 1372.1996 1383.9408 1390.4898 1395.7801 1427.3259 1445.2066 1446.2895 1450.3171 1459.4415 1463.4332 1466.3461 1466.8177 1476.1534 1483.0960 1508.0168 1540.1449 1554.1933 1583.6067 1593.0799 1608.7765 1621.9753 1645.1807 1661.5356 2826.5169 2835.0095 2881.3099 2968.4133 2986.5969 2987.0520 3027.0169 3029.5378 3034.8862 3037.0028 3042.0330 3047.4768 3056.4596 3104.7965 3113.4603 3137.4522 3140.7444 3151.7854 3154.4453 3156.3880 3167.0077 3174.5450 3175.3002
redmass: 5.1859 8.5780 2.8742 6.4501 7.6222 7.5403 4.1341 6.5646 4.3516 6.0983 5.0139 6.0395 7.1418 5.1731 8.1670 4.8959 6.8101 4.3396 4.3961 4.3000 2.5250 3.2611 2.7686 3.9632 7.1141 3.5382 7.0739 3.2908 5.0313 7.7160 2.2227 7.9315 2.8254 3.7502 8.0856 4.4665 3.2779 2.8717 6.0232 3.6097 4.4232 3.7768 6.1321 2.5103 4.5548 6.4712 6.6952 7.6203 6.5847 7.6124 7.1092 3.3767 2.9553 3.9716 4.2213 4.1101 4.9216 1.8908 1.6521 1.4911 4.3624 1.4598 4.5509 1.9406 1.9628 6.7140 2.6152 2.2017 1.5527 2.3827 1.9421 6.1566 1.3070 1.3667 1.3532 2.8406 2.4983 5.2066 1.3321 2.1614 1.1299 4.0053 2.2798 2.7789 2.3604 2.0567 2.7851 2.3811 2.2530 1.4526 1.6377 1.4157 1.4798 2.4199 1.2187 1.7956 2.0287 1.9597 1.2782 1.6259 1.1893 2.4211 1.4279 1.4194 2.8232 1.6177 1.3287 1.3617 2.2027 1.6733 2.8039 1.4313 1.6950 1.7841 2.0621 3.6536 1.4882 5.0083 1.4286 3.5087 2.8905 3.4920 1.1135 1.0916 1.0880 1.0841 2.7972 1.1015 1.0888 1.0951 5.2131 7.7903 7.2012 7.9682 6.8728 9.9781 6.9459 5.9286 11.2998 1.0715 1.0700 1.0700 1.0624 1.0616 1.0611 1.0868 1.0908 1.0661 1.0911 1.0853 1.1033 1.1037 1.1060 1.0909 1.0865 1.0906 1.0899 1.0881 1.0922 1.0960 1.0972 1.1000
irintensity: 0.0624 0.0613 0.1397 0.5543 0.1699 0.1907 0.2971 0.7174 0.3683 0.8960 0.1117 1.2425 0.1149 0.3599 4.6473 0.0729 0.2536 1.4239 0.1266 0.1477 2.3922 3.6649 2.8262 1.3681 6.0769 1.0260 7.9321 2.9571 0.0234 1.1553 6.2279 13.7237 6.3503 16.8794 24.8465 11.1201 3.1079 0.2658 1.5835 10.6382 7.5788 0.2881 2.8946 2.4548 5.2509 11.2484 18.6556 4.1171 11.8004 28.5158 0.6973 4.9186 0.3128 9.2438 2.3280 14.7318 1.0530 23.6118 72.5550 0.3507 3.0691 28.5327 10.7509 2.9777 13.9997 11.8962 24.5493 22.3069 0.0211 8.2373 0.0195 9.9561 2.1334 0.9120 2.2352 41.0861 13.8219 32.8672 0.0346 9.6079 54.8862 23.8384 4.5682 10.3805 62.6425 38.7982 1.6593 17.3762 97.1733 9.4228 8.1304 0.8229 0.1283 47.6578 0.5083 106.3464 10.5344 8.6531 7.7493 6.4427 4.4965 0.1077 39.0998 6.5479 11.5085 15.0661 42.5579 26.6263 8.9935 23.5025 131.3674 1.4079 8.4006 40.7770 145.5114 11.6913 89.7163 13.8404 18.2971 18.5387 33.6602 3.6990 33.1715 6.9216 12.4250 5.0545 136.0016 9.0733 1.6532 14.0200 121.4621 26.8853 49.7360 137.8653 16.7346 450.1593 2.5400 100.6147 52.7616 38.0440 143.5587 90.4653 41.0368 34.8297 34.4015 49.0778 66.6310 5.0164 41.0453 23.8222 18.0397 97.0220 3.5721 1.3718 4.5748 28.3935 8.4133 0.2623 1.1965 4.7773 3.4262 30.3638
temp: 298.150 k
press: 1.00000 atm
elementType: 17 17 8 8 7 7 7 6 6 6 6 6 6 6 6 6 6 6 6 6 6 6 6 6 6 6 6 6 6 6 6 6 6 1 1 1 1 1 1 1 1 1 1 1 1 1 1 1 1 1 1 1 1 1 1 1
symmnumber: 1
zpe: 1133920.0 jmol-1
zpe.correction: 0.431887 hartree
zpe.thermalcorrener: 0.460142 hartree
zpe.thermalcorrenthalpy: 0.461086 hartree
zpe.thermalcorrgfe: 0.369155 hartree
zpe.sumelectzpe: -2237.079487 hartree
zpe.sumelectthermal: -2237.051233 hartree
zpe.sumelectthermalent: -2237.050289 hartree
zpe.sumelectthermalfe: -2237.142220 hartree
dipole: 3.5837 1.7823 0.9444
dipole: 4.1123
quadrupole: -224.8777 -182.1324 -209.9120
quadrupole: -13.0610 4.4521 1.4212
quadrupole: -19.2370 23.5083 -4.2713 -13.0610 4.4521 1.4212
hfenergy: -2237.5113747 hartree
pointgroup: C01 [X(C26H23Cl2N3O2)]
dipole: -1.3718243 0.8027282 -0.3023184 debye
polarizability: 565.2655614|-93.3441574|501.7575416|-31.9433478|-5.3601909|159.1510431 unknown
InChI: InChI=1S/C26H23Cl2N3O2/c27-19-10-8-17(16-20(19)28)9-11-22-24-23(18-6-2-3-7-21(18)29-22)25(32)31(26(24)33)15-14-30-12-4-1-5-13-30/h2-3,6-11,16H,1,4-5,12-15H2
charge 0 multiplicity 1
56 atoms
Cl 8.554997 -1.149899 -0.70023
Cl 7.710041 -4.3121 -0.311716
O  -3.516669 2.212485 0.661053
O  -0.604502 -1.477648 0.604796
N  -5.212986 -2.157402 -0.133095
N  -2.325644 0.155663 0.695977
N  1.73199 2.406727 -0.083131
C  -6.433606 -1.311966 -0.182472
C  -5.356241 -3.379213 -0.965756
C  -7.668514 -2.091844 0.311762
C  -6.55604 -4.224501 -0.490829
C  -7.857187 -3.389455 -0.508181
C  -3.97571 -1.394487 -0.390313
C  -3.46301 -0.74869 0.923841
C  -1.043464 2.065902 0.32999
C  -2.441766 1.565408 0.571297
C  -0.172411 0.968165 0.313221
C  -0.976315 -0.276288 0.542794
C  -0.562201 3.388836 0.142871
C  1.235958 1.146425 0.102115
C  0.881724 3.494097 -0.065173
C  -1.373766 4.568348 0.148135
C  2.149697 0.000139 0.081461
C  1.450242 4.79645 -0.260728
C  -0.779961 5.816887 -0.045719
C  0.636006 5.929928 -0.250576
C  3.499448 0.127841 -0.120539
C  4.478837 -0.963452 -0.158457
C  5.847544 -0.636506 -0.375109
C  4.135122 -2.338245 0.009264
C  6.83286 -1.63882 -0.422565
C  5.120823 -3.337878 -0.039205
C  6.475078 -2.99351 -0.255679
H  -6.275406 -0.41532 0.444469
H  -6.620741 -0.949986 -1.228611
H  -5.499361 -3.12072 -2.048638
H  -4.422643 -3.966218 -0.885734
H  -8.565077 -1.44703 0.235142
H  -7.52593 -2.345176 1.379961
H  -6.355301 -4.575162 0.53999
H  -6.655259 -5.117348 -1.137728
H  -8.702669 -3.981006 -0.109227
H  -8.111342 -3.127033 -1.556364
H  -4.11836 -0.595289 -1.158535
H  -3.197776 -2.081136 -0.770427
H  -3.150868 -1.543833 1.620882
H  -4.262982 -0.152407 1.394657
H  -2.451634 4.465261 0.306409
H  1.677459 -0.975722 0.239822
H  2.531278 4.860588 -0.414708
H  -1.396356 6.722126 -0.041955
H  1.078401 6.920896 -0.400187
H  3.883375 1.146395 -0.26863
H  6.144298 0.409054 -0.507311
H  3.094562 -2.63082 0.178249
H  4.855064 -4.391107 0.089361
