program: Gaussian 09
title: 000278521
version: EM64L-G09RevD.01
frameworkgroup: C1[X(C13H22O3)]
method: RPBEPBE
basis: SDD
operation: Freq
keyword: #pfreq=noraman
keyword: PBEPBE/SDD
title: #p freq=noraman PBEPBE/SDD
converged: YES YES NO NO
title: Mulliken charges:
elementType: O O O C C C C C C C C C C C C C H H H H H H H H H H H H H H H H H H H H H H
charge: -0.263979 -0.190963 -0.256320 -0.177029 -0.156836 -0.277477 0.156933 -0.112414 -0.708650 -0.613438 -0.691158 -0.688322 0.029977 0.274614 -0.684010 -0.677845 0.261113 0.205541 0.231769 0.245099 0.269575 0.257779 0.240652 0.223214 0.214021 0.208209 0.221955 0.216047 0.213884 0.208703 0.227059 0.234280 0.209307 0.231908 0.227108 0.212407 0.251565 0.225722
chargesum: 0.00000
title: Mulliken charges with hydrogens summed into heavy atoms:
elementType: O O O C C C C C C C C C C C C C
charge: -0.263979 -0.190963 -0.256320 0.084084 0.048706 -0.045708 0.156933 0.132685 -0.030764 -0.086084 -0.044947 -0.038677 0.264257 0.274614 -0.015686 0.011848
polarizability: 1.91844433e+02 -3.69049863e+00 1.42676230e+02 2.63704896e+00 -4.29604074e+00 1.28555701e+02
1716.lowfreq: -11.7666 -5.1190 0.0002 0.0008 0.0009 5.0104 12.0110 19.1097 22.8092
frequency: 11.8890 18.9612 22.5548 45.3184 56.9605 72.6492 84.5394 94.6252 116.5954 147.5249 164.1625 187.4466 196.6992 198.2643 209.8383 234.7774 242.2291 266.2416 275.6764 299.6412 332.7279 365.7918 386.1751 412.8104 444.4488 454.4049 458.4684 499.6524 533.4533 612.5824 636.7416 724.4442 763.7427 790.1803 831.4267 846.1239 880.6083 908.8086 914.3284 926.9988 930.6698 941.2375 945.4794 952.6079 957.1594 982.5133 1010.9454 1051.8213 1084.3460 1103.5771 1108.8368 1116.2971 1140.7178 1142.5247 1157.8325 1179.9053 1184.0038 1203.5265 1242.4015 1276.8990 1282.4136 1300.4311 1301.8603 1324.8561 1328.0641 1335.7206 1349.9595 1372.8944 1382.7570 1386.9384 1390.8918 1398.0497 1435.4892 1456.7171 1465.1582 1465.2894 1466.6551 1467.8148 1472.8670 1473.0825 1477.3353 1486.0737 1487.2806 1609.6617 1633.0915 1667.6665 2969.9789 2970.5588 2973.5815 2978.6928 2991.4058 2991.6036 2994.7611 3022.2171 3028.9304 3056.4934 3063.4294 3071.4632 3076.3324 3082.0524 3085.8959 3087.1964 3087.4996 3094.9343 3100.2580 3102.9751 3106.5631 3124.1966
redmass: 3.9877 3.4722 2.9798 4.0291 3.8519 4.7809 5.0161 3.1305 2.7187 4.0688 3.2030 1.0474 1.5909 1.0401 1.1073 1.2733 1.4886 3.1494 2.7595 2.2759 2.4146 2.7374 3.8105 2.4158 3.1518 2.3760 3.0668 3.5873 4.4998 3.7354 5.8023 3.1625 3.7683 4.4534 1.9162 2.3043 3.1223 2.4574 1.1858 1.2057 2.5729 1.8038 1.6697 1.4467 1.9722 1.1446 1.6656 2.2534 2.0032 1.7800 2.2004 2.1320 2.2092 2.2379 2.0317 1.8074 1.9076 1.5724 1.4781 1.4742 1.3440 1.3102 1.3263 1.4619 1.4845 1.3626 1.5428 1.1978 1.2572 1.1945 1.2063 1.2272 1.0919 1.0519 1.0470 1.0452 1.0508 1.0465 1.0510 1.0514 1.0478 1.0550 1.0478 9.5244 9.1735 6.4131 1.0819 1.0349 1.0353 1.0843 1.0351 1.0356 1.0359 1.0614 1.0866 1.0915 1.0999 1.0987 1.1004 1.0996 1.0906 1.0994 1.0991 1.0987 1.1007 1.1002 1.1008 1.1001
irintensity: 1.1701 0.0583 0.3822 2.8644 0.7592 1.4176 0.3748 0.6770 0.5819 3.6911 2.6964 0.0215 2.8774 0.1466 1.8929 0.8936 6.2233 3.8474 2.1090 0.0949 0.6188 1.6337 5.3094 6.2367 4.0426 0.9442 1.2375 7.0384 5.5009 8.1429 2.2463 3.8921 4.7857 14.1823 1.3847 8.5999 2.5426 27.1136 0.8617 2.5700 21.1705 12.8994 10.4614 2.2000 26.5007 49.1632 12.9379 5.1387 453.7874 12.3348 12.3829 8.2448 107.9716 133.2399 11.5768 4.0463 12.1013 54.6816 4.4538 163.8907 6.1474 3.9977 8.8505 7.2852 16.7489 3.0968 11.1528 15.5621 31.7389 22.1269 9.4853 16.6234 17.2998 6.4976 6.2971 5.3933 1.5973 8.2517 1.0149 16.5958 13.2237 17.1843 21.8616 216.9713 69.0126 0.3558 0.2240 31.8839 37.5795 14.3363 24.5479 19.8363 22.2033 1.5347 7.0036 2.0920 1.4845 94.4908 30.8615 45.7138 19.8833 9.5697 45.3611 50.4622 21.1017 18.4612 29.1965 2.0202
temp: 298.150 k
press: 1.00000 atm
elementType: 8 8 8 6 6 6 6 6 6 6 6 6 6 6 6 6 1 1 1 1 1 1 1 1 1 1 1 1 1 1 1 1 1 1 1 1 1 1
symmnumber: 1
zpe: 847338.0 jmol-1
zpe.correction: 0.322734 hartree
zpe.thermalcorrener: 0.343034 hartree
zpe.thermalcorrenthalpy: 0.343978 hartree
zpe.thermalcorrgfe: 0.270404 hartree
zpe.sumelectzpe: -732.965276 hartree
zpe.sumelectthermal: -732.944977 hartree
zpe.sumelectthermalent: -732.944032 hartree
zpe.sumelectthermalfe: -733.017607 hartree
dipole: -0.6468 -1.8041 -1.4224
dipole: 2.3867
quadrupole: -78.9109 -98.1755 -106.3023
quadrupole: 0.1674 -2.6262 -2.6244
quadrupole: 15.5520 -3.7126 -11.8394 0.1674 -2.6262 -2.6244
hfenergy: -733.2880104 hartree
pointgroup: C01 [X(C13H22O3)]
dipole: 0.2148854 -0.6169693 -0.6744493 debye
polarizability: 192.2041675|-1.7315751|127.8639828|0.4870657|-2.8249276|143.0082133 unknown
InChI: InChI=1S/C13H22O3/c1-9(2)6-7-11(5)12(14)8-13(15)16-10(3)4/h6-7,9-11H,8H2,1-5H3
charge 0 multiplicity 1
38 atoms
O  2.817237 0.277613 -0.985286
O  -0.232381 1.939939 1.073039
O  1.941712 -1.413398 0.367647
C  -0.897418 -0.382815 1.533516
C  -4.33275 -0.497253 -0.503304
C  -2.202902 -0.827783 0.866126
C  -0.232114 0.733871 0.720184
C  -3.014813 -0.050026 0.102771
C  -1.135524 0.032849 3.00549
C  0.451348 0.308166 -0.600541
C  -4.280861 -0.412854 -2.052441
C  -5.503232 0.358903 0.050835
C  4.216177 -0.27575 -0.799489
C  1.783662 -0.385105 -0.337066
C  4.987912 0.166487 -2.043909
C  4.783436 0.266616 0.519165
H  -0.198613 -1.245497 1.501365
H  -4.507726 -1.554793 -0.217636
H  -2.502438 -1.86566 1.07769
H  -2.731774 0.996833 -0.101709
H  0.612087 1.193852 -1.232082
H  -0.209468 -0.412626 -1.116527
H  -1.749964 0.947547 3.049292
H  -0.178607 0.237755 3.517855
H  -1.659893 -0.771344 3.55144
H  -4.091225 0.626716 -2.381858
H  -3.478243 -1.052518 -2.461618
H  -5.241628 -0.73671 -2.494347
H  -6.466559 0.032827 -0.383897
H  -5.361211 1.426792 -0.202973
H  -5.57177 0.277491 1.150197
H  4.119739 -1.376372 -0.748992
H  6.024462 -0.21348 -1.995872
H  4.515123 -0.223322 -2.961316
H  5.023282 1.267933 -2.109821
H  5.817391 -0.09821 0.659511
H  4.179782 -0.074095 1.376677
H  4.802265 1.370522 0.508087
