program: Gaussian 09
title: 000025292
version: EM64L-G09RevD.01
frameworkgroup: C1[X(C24H19N)]
method: RPBEPBE
basis: SDD
operation: Freq
keyword: #pfreq=noraman
keyword: PBEPBE/SDD
title: #p freq=noraman PBEPBE/SDD
converged: YES YES NO NO
title: Mulliken charges:
elementType: N C C C C C C C C C C C C C C C C C C C C C C C C H H H H H H H H H H H H H H H H H H H
charge: -0.022901 0.233139 -0.162643 0.157846 0.168420 -0.121750 -0.138610 0.176491 0.172100 -0.808766 -0.744835 0.401054 0.399563 -0.353506 -0.347957 -0.467464 -0.468242 -0.362471 -0.375808 -0.455456 -0.459949 -0.277411 -0.269251 -0.252032 -0.251267 0.258581 0.220181 0.247236 0.237776 0.227118 0.217085 0.249975 0.270052 0.269834 0.242565 0.242551 0.269048 0.271808 0.242277 0.241896 0.229881 0.231108 0.231846 0.230889
chargesum: 0.00000
title: Mulliken charges with hydrogens summed into heavy atoms:
elementType: N C C C C C C C C C C C C C C C C C C C C C C C C
charge: -0.022901 0.233139 0.095938 0.157846 0.168420 -0.121750 -0.138610 0.176491 0.172100 -0.103572 -0.050657 0.401054 0.399563 -0.083454 -0.078122 -0.224899 -0.225691 -0.093424 -0.104001 -0.213179 -0.218053 -0.047530 -0.038144 -0.020186 -0.020379
polarizability: 4.92974649e+02 -1.44170368e+00 2.97519712e+02 6.88001277e-01 1.57905735e+01 1.24877008e+02
1716.lowfreq: -4.0844 -0.0006 -0.0002 0.0006 7.7162 8.8291 37.4442 44.1168 69.6899
frequency: 37.4071 44.1092 69.6665 99.6226 122.9298 146.8094 159.1299 194.3608 202.5003 213.6588 233.3531 246.0690 256.9797 276.5706 292.2369 320.0060 331.5535 364.2128 401.2421 416.3585 424.8771 426.6090 445.5170 478.5304 510.2517 518.8950 525.7481 545.1806 555.4437 562.9282 574.8160 582.7491 617.6773 651.8352 666.8575 678.0298 722.8684 734.2220 739.1296 760.7239 761.9971 771.6439 795.3088 806.9049 816.6575 840.2626 848.3364 862.6639 883.3705 885.2041 888.5511 933.4707 951.7138 957.1631 959.4819 972.0912 977.8877 983.1595 985.8721 992.5372 994.1058 996.0008 1043.5263 1049.5106 1080.1049 1097.2860 1102.6947 1129.9619 1143.4004 1150.2826 1163.7382 1174.0718 1179.1626 1205.6983 1227.8333 1234.9264 1239.1676 1277.0120 1285.3183 1297.2964 1299.6077 1328.6487 1339.2129 1349.1139 1372.5800 1383.8456 1392.0740 1394.9099 1396.0202 1406.1512 1418.3153 1426.4979 1448.4997 1462.0346 1472.7172 1478.3217 1481.6923 1488.2885 1502.6612 1514.0295 1522.4274 1547.3712 1554.6690 1612.4051 1614.4807 1621.4564 1632.4277 2976.8019 2983.1207 3011.1408 3066.5173 3072.9693 3080.8908 3099.3461 3122.2766 3123.1411 3130.8047 3131.4622 3135.1744 3135.8785 3159.6824 3160.1983 3169.7581 3170.8293 3225.2881 3237.0176
redmass: 4.2507 4.5055 3.8457 3.9059 4.1965 4.6110 3.0422 3.5803 3.3356 4.3106 2.7914 3.7106 1.3357 2.6837 2.1872 4.1576 2.0336 4.0430 4.6927 3.3010 3.8828 4.2364 3.2662 3.6437 5.4464 5.7367 3.5350 5.2563 4.2195 3.7181 4.2067 6.0329 4.8425 5.3696 5.1840 3.5595 6.3691 5.4248 3.4826 1.3235 1.3267 4.6947 3.6436 4.2156 2.7096 1.5401 2.2015 3.4346 2.0485 1.6250 2.7434 1.5749 1.7299 1.6044 1.4225 1.4442 6.6304 1.6845 1.3524 1.3920 1.3503 2.0954 2.1566 2.1817 1.8830 2.6355 2.1082 1.9659 1.3135 1.3025 1.8875 1.0836 1.1326 2.3622 2.0512 1.7437 2.2759 1.6899 2.9884 2.2048 3.1324 1.3153 2.9003 4.3027 1.4119 1.2546 5.8968 5.2530 1.3658 1.9482 4.2348 2.5644 2.5369 2.4042 1.0451 1.1963 2.1658 1.1082 1.1178 3.2567 5.8449 5.9259 6.7363 6.2713 6.1031 6.7540 7.1688 1.0362 1.0364 1.0831 1.0994 1.0991 1.0999 1.0996 1.0869 1.0868 1.0887 1.0888 1.0907 1.0907 1.0991 1.0991 1.0970 1.0971 1.0901 1.0898
irintensity: 0.1633 0.1484 0.4371 0.5354 0.5439 0.0872 1.2922 0.7676 0.0193 0.8292 0.9381 0.1798 1.6866 4.7572 0.5492 0.4623 0.9037 0.6304 0.3711 0.7891 4.2052 4.3633 0.7993 10.0830 2.1500 1.9625 0.9837 1.0219 7.5555 0.5598 3.3109 1.5463 18.1471 3.5042 0.9241 4.3148 0.3072 1.6973 14.7472 29.7927 69.6242 0.1888 1.7690 10.4362 15.6705 0.2864 89.4395 6.2502 5.0643 13.2758 7.1172 4.5850 2.2683 6.3301 6.2935 1.0927 1.5930 2.7179 0.2776 0.3926 0.7602 6.4886 5.2646 6.1954 5.2915 2.7801 2.0367 12.2034 0.6565 4.0065 17.2734 0.7343 1.0649 7.9746 0.6342 9.1063 2.4195 3.6962 2.0483 0.7254 2.5012 5.0628 7.9638 2.1343 3.3449 14.3613 0.5325 0.6228 4.6447 5.4874 23.7149 0.6053 10.6172 1.1440 6.4413 6.5831 4.8913 3.0420 12.9000 3.9903 64.5431 3.0923 4.4063 9.4180 0.4455 0.1065 0.1142 24.9163 29.4314 2.8738 24.5325 26.3854 25.9483 21.4800 2.6535 2.3487 6.3960 6.1980 19.6590 20.7935 53.2898 36.5950 16.9147 16.5672 3.2498 2.9288
temp: 298.150 k
press: 1.00000 atm
elementType: 7 6 6 6 6 6 6 6 6 6 6 6 6 6 6 6 6 6 6 6 6 6 6 6 6 1 1 1 1 1 1 1 1 1 1 1 1 1 1 1 1 1 1 1
symmnumber: 1
zpe: 931590.7 jmol-1
zpe.correction: 0.354824 hartree
zpe.thermalcorrener: 0.373899 hartree
zpe.thermalcorrenthalpy: 0.374844 hartree
zpe.thermalcorrgfe: 0.308665 hartree
zpe.sumelectzpe: -979.031775 hartree
zpe.sumelectthermal: -979.012700 hartree
zpe.sumelectthermalent: -979.011756 hartree
zpe.sumelectthermalfe: -979.077934 hartree
dipole: 0.0225 -2.7748 0.2047
dipole: 2.7824
quadrupole: -121.7041 -136.7993 -152.5992
quadrupole: -0.4630 0.1278 2.6284
quadrupole: 15.3301 0.2349 -15.5650 -0.4630 0.1278 2.6284
hfenergy: -979.3865995 hartree
pointgroup: C01 [X(C24H19N1)]
dipole: -0.0088544 -1.0946608 -0.0014873 debye
polarizability: 492.8284522|-4.2829938|294.2845254|-4.2403244|28.5824241|128.2583919 unknown
InChI: InChI=1S/C24H19N/c1-15(2)22-23-18-9-5-3-7-16(18)11-13-20(23)25-21-14-12-17-8-4-6-10-19(17)24(21)22/h3-15H,1-2H3
charge 0 multiplicity 1
44 atoms
N  0.078932 2.499876 0.201758
C  0.004475 -0.384612 0.11543
C  0.054977 -1.802042 0.766976
C  1.257544 0.326369 -0.03934
C  -1.21455 0.386581 -0.009849
C  1.228132 1.778781 0.05841
C  -1.108244 1.832427 0.123111
C  2.583749 -0.298874 -0.225637
C  -2.571343 -0.151593 -0.212178
C  -0.152867 -3.101712 -0.082687
C  -0.84418 -1.853597 2.0350
C  3.780411 0.505371 -0.100971
C  -3.725387 0.692863 0.001628
C  2.452331 2.548001 0.141577
C  -2.290623 2.651583 0.300347
C  3.68137 1.933172 0.11106
C  -3.54941 2.097553 0.299803
C  2.76853 -1.659854 -0.626611
C  -2.816938 -1.459228 -0.726984
C  5.068497 -0.090191 -0.252259
C  -5.040424 0.162181 -0.159336
C  4.042851 -2.224372 -0.793378
C  -4.115621 -1.95927 -0.907375
C  5.210391 -1.445304 -0.576011
C  -5.243924 -1.156021 -0.588619
H  1.090634 -1.86207 1.146783
H  -0.025009 -2.943629 -1.169121
H  -1.15568 -3.5316 0.080921
H  0.580524 -3.868031 0.230996
H  -0.63427 -1.003173 2.707971
H  -0.635265 -2.788321 2.588897
H  -1.917745 -1.840418 1.785107
H  2.335068 3.628912 0.259033
H  -2.115684 3.719622 0.457871
H  4.605418 2.514981 0.206473
H  -4.438256 2.716135 0.469537
H  1.902994 -2.275558 -0.863925
H  -1.970756 -2.066521 -1.038722
H  5.954072 0.545531 -0.134075
H  -5.896863 0.820022 0.031095
H  4.133005 -3.26973 -1.108781
H  -4.258199 -2.966864 -1.313437
H  6.204117 -1.890319 -0.693601
H  -6.257883 -1.550356 -0.714887
