program: Gaussian 09
title: 000278519
version: EM64L-G09RevD.01
frameworkgroup: C1[X(C12H17NO2)]
method: RPBEPBE
basis: SDD
operation: Freq
keyword: #p
keyword: freq=noraman
keyword: PBEPBE/SDD
title: #p freq=noraman PBEPBE/SDD
converged: YES YES NO NO
title: Mulliken charges:
elementType: O O N C C C C C C C C C C C C H H H H H H H H H H H H H H H H H
charge: -0.278336 -0.259408 -0.049202 0.040067 0.339151 -0.681993 -0.685866 -0.434651 0.009047 0.414657 0.165550 -0.777243 -0.783719 -0.798352 -0.191637 0.230795 0.205365 0.234484 0.230016 0.213238 0.250547 0.225006 0.222667 0.218528 0.257959 0.256195 0.228400 0.231725 0.237582 0.268080 0.217931 0.243415
chargesum: 0.00000
title: Mulliken charges with hydrogens summed into heavy atoms:
elementType: O O N C C C C C C C C C C C C
charge: -0.278336 -0.259408 -0.049202 0.270863 0.339151 -0.012128 0.002925 -0.211984 0.009047 0.414657 0.165550 -0.044560 -0.086012 -0.068926 -0.191637
polarizability: 2.12992409e+02 -2.97509393e+00 1.52493278e+02 4.02297673e+00 -1.49371662e+00 1.02031987e+02
1716.lowfreq: -12.7761 -2.0890 -0.0004 -0.0003 -0.0002 8.1282 22.4020 37.7580 70.2635
frequency: 20.4522 37.6657 70.2379 75.3293 88.6901 98.5835 124.7019 137.2352 158.3198 173.3261 177.6184 183.6914 223.7132 229.5600 251.6026 260.7254 280.3853 304.4247 366.1291 383.4590 394.4680 428.9865 453.2599 469.8820 489.8882 513.1721 562.9062 579.6275 628.5320 743.5985 775.7135 780.6338 827.0897 835.4095 897.5668 927.1156 942.5187 951.1455 957.7676 983.8999 1022.3816 1033.3712 1065.2042 1081.2971 1094.8801 1109.3753 1156.4659 1179.6583 1208.5081 1216.3150 1266.8387 1325.3518 1333.1448 1369.9016 1380.2326 1388.7836 1395.2746 1396.8850 1400.8114 1445.5266 1450.2004 1453.9627 1454.2551 1455.9454 1464.9790 1467.1310 1471.4796 1474.8070 1486.2574 1547.5182 1598.5413 1635.8635 2164.7424 2966.4088 2971.8137 2990.2217 2991.9546 2994.4108 3025.6795 3041.5879 3048.5792 3072.3677 3080.8544 3085.4999 3091.3303 3094.2195 3097.2647 3100.9903 3104.9598 3106.1591
redmass: 3.1142 3.6539 4.1294 3.3386 4.1462 3.5925 2.5780 1.2162 1.4200 1.5414 2.1090 2.0648 1.2363 1.0952 3.1861 4.0428 4.5756 3.2775 2.6906 3.2054 3.4595 2.7202 2.8941 3.0885 3.3936 7.8420 5.0054 5.2642 4.2440 8.9654 4.3075 6.1613 3.0539 1.4333 2.6124 1.2211 1.3625 1.3740 1.9027 1.3362 1.8038 2.6471 1.8656 1.7198 2.1076 2.4687 2.0630 2.1411 3.2473 2.7889 4.6753 1.5028 1.3384 1.4925 1.2513 1.2570 1.2091 1.2320 1.2255 1.0716 1.0536 1.0958 1.0703 1.0518 1.0483 1.0840 1.0499 1.0862 1.0483 7.5460 9.2051 5.9186 12.6136 1.0375 1.0384 1.0356 1.0373 1.0359 1.0864 1.0964 1.0953 1.0942 1.0882 1.0992 1.0978 1.0988 1.0984 1.1008 1.1013 1.1006
irintensity: 1.2569 2.5671 1.0889 0.5614 0.2466 3.1067 1.2698 0.8382 0.3272 0.8651 1.2579 3.9743 0.0850 2.8819 0.5812 3.7517 4.4977 0.6583 1.1172 2.3324 11.4931 1.5310 3.5815 2.6911 12.8505 0.2680 13.1330 0.8075 6.2448 4.9287 6.2336 2.6075 0.7095 36.4949 7.5956 2.5689 1.2489 0.8081 71.8827 4.2000 8.6633 222.9406 11.9536 13.3427 189.1748 1.7632 13.4061 109.6821 161.3133 158.4322 13.6288 4.1402 2.9934 2.1716 33.9568 39.1047 21.4168 18.8057 25.8267 30.0368 10.4037 22.3509 7.4655 6.9938 8.3156 41.2520 8.1378 21.5529 19.4834 243.9808 172.8653 92.0741 21.0924 14.4480 29.3774 15.4439 7.2175 24.4377 8.4144 8.7244 24.7883 8.0146 11.7748 7.2930 33.8874 56.0126 13.7394 17.0176 25.8392 28.7282
temp: 298.150 k
press: 1.00000 atm
elementType: 8 8 7 6 6 6 6 6 6 6 6 6 6 6 6 1 1 1 1 1 1 1 1 1 1 1 1 1 1 1 1 1
symmnumber: 1
zpe: 685754.6 jmol-1
zpe.correction: 0.261190 hartree
zpe.thermalcorrener: 0.279268 hartree
zpe.thermalcorrenthalpy: 0.280212 hartree
zpe.thermalcorrgfe: 0.214518 hartree
zpe.sumelectzpe: -671.501031 hartree
zpe.sumelectthermal: -671.482953 hartree
zpe.sumelectthermalent: -671.482009 hartree
zpe.sumelectthermalfe: -671.547703 hartree
dipole: 1.3782 1.8924 1.1589
dipole: 2.6122
quadrupole: -66.6769 -99.9633 -89.7077
quadrupole: 4.3397 1.2430 -5.9590
quadrupole: 18.7724 -14.5140 -4.2584 4.3397 1.2430 -5.9590
hfenergy: -671.7622214 hartree
pointgroup: C01 [X(C12H17N1O2)]
dipole: 0.5168557 0.8238297 0.3322259 debye
polarizability: 212.9796938|-0.4733461|150.5754604|5.6708517|-9.4534611|103.9625195 unknown
InChI: InChI=1S/C12H17NO2/c1-8(2)6-10(5)11(7-13)12(14)15-9(3)4/h6,9H,1-5H3
charge 0 multiplicity 1
32 atoms
O  -2.131057 -0.431092 -0.011679
O  -1.67319 1.859083 0.032639
N  0.561682 -2.385649 -0.216525
C  -3.608228 -0.149366 0.125583
C  1.211048 1.11173 -0.294429
C  -4.302214 -1.362048 -0.497316
C  -3.932841 0.065463 1.610954
C  2.61793 0.687537 -0.328903
C  0.146793 0.215021 -0.1462
C  3.296143 -0.182808 0.495902
C  -1.272623 0.666156 -0.035443
C  0.987608 2.60032 -0.493733
C  4.768918 -0.451016 0.249572
C  2.714509 -0.873816 1.7077
C  0.365772 -1.205284 -0.174314
H  -3.813831 0.775762 -0.445032
H  -5.398619 -1.230678 -0.452837
H  -4.005841 -1.485581 -1.552661
H  -4.036321 -2.284446 0.047664
H  -5.017337 0.240109 1.735521
H  -3.395673 0.943088 2.007557
H  -3.654144 -0.826197 2.199731
H  3.221434 1.222674 -1.077866
H  1.927365 3.089522 -0.800025
H  0.19342 2.813286 -1.228215
H  0.644486 3.067532 0.448201
H  5.381743 -0.130667 1.114745
H  5.144078 0.058558 -0.653821
H  4.93955 -1.538897 0.128666
H  2.514674 -1.941002 1.486334
H  3.436074 -0.839339 2.545558
H  1.761889 -0.429857 2.038573
