program: Gaussian 09
title: 000278572
version: EM64L-G09RevD.01
frameworkgroup: C1[X(C15H18N3O8P)]
method: RPBEPBE
basis: SDD
operation: Freq
keyword: #p
keyword: freq=noraman
keyword: PBEPBE/SDD
title: #p freq=noraman PBEPBE/SDD
converged: YES YES NO NO
title: Mulliken charges:
elementType: P O O O O O O O O N N N C C C C C C C C C C C C C C C H H H H H H H H H H H H H H H H H H
charge: 1.368392 -0.263001 -0.430174 -0.472580 -0.516684 -0.270392 -0.531956 -0.667052 -0.573484 -0.212753 -0.054666 -0.622655 -0.160416 -0.168753 -0.092682 -0.100183 -0.304457 0.013195 0.058729 -0.383645 0.192211 0.363007 -0.347872 -0.409066 -0.198733 -0.218147 -0.246719 0.286819 0.287088 0.271629 0.277444 0.257456 0.264863 0.355079 0.382810 0.269238 0.229814 0.409909 0.317913 0.340368 0.289892 0.280715 0.240070 0.248083 0.241346
chargesum: 0.00000
title: Mulliken charges with hydrogens summed into heavy atoms:
elementType: P O O O O O O O O N N N C C C C C C C C C C C C C C C
charge: 1.368392 -0.263001 -0.075095 -0.089770 -0.516684 -0.270392 -0.531956 -0.257143 -0.573484 -0.212753 -0.054666 0.035626 0.126403 0.118335 0.178947 0.177261 0.217862 0.282433 0.058729 -0.153831 0.192211 0.363007 -0.057980 -0.128351 0.041337 0.029936 -0.005373
polarizability: 2.69953828e+02 1.45979317e+01 2.07615415e+02 -3.56780135e+01 2.01078420e+01 2.18231850e+02
1716.lowfreq: -7.9442 -4.7412 -0.0006 0.0008 0.0012 2.3779 15.1369 18.4687 20.7873
frequency: 14.7739 18.3710 20.6900 28.0513 40.5094 54.5734 63.2639 72.5178 89.7089 98.9818 105.3732 113.5955 143.0325 168.3954 174.0804 199.7326 204.6287 213.7112 221.9517 238.1757 251.1965 271.2019 289.3569 294.6672 305.0888 327.7761 347.8630 363.6705 378.0200 388.4099 400.2823 407.3751 422.2367 428.7657 439.2092 468.2243 494.9804 524.0124 533.4989 539.7879 569.3690 574.0048 597.6865 604.7322 635.8678 689.4915 695.0462 697.2260 715.0878 724.6470 737.3506 748.1545 765.6433 767.9441 769.2515 801.1479 825.2649 826.7445 845.0707 860.2599 906.3115 914.6057 919.0288 933.1628 935.0824 962.2476 973.9543 985.0493 988.9429 994.6958 1008.6567 1010.9457 1019.6048 1021.4139 1029.7006 1073.0991 1075.5297 1081.0077 1082.4328 1105.6886 1165.3568 1168.1303 1174.3062 1178.7853 1188.9952 1190.2334 1202.5341 1222.5822 1229.9128 1258.3670 1274.0198 1283.1234 1314.8568 1315.2878 1334.3028 1346.6754 1358.1079 1364.1591 1378.2413 1385.8671 1415.8450 1439.2358 1472.0995 1474.9061 1479.1018 1511.8007 1590.4636 1594.0168 1599.0930 1631.4786 1649.9986 3008.8203 3026.0087 3041.6933 3048.9282 3092.6205 3108.4872 3137.1312 3142.0505 3154.1949 3167.1991 3177.4231 3177.7462 3211.8973 3502.2441 3541.2175 3549.4542 3605.6270 3699.6154
redmass: 6.0742 6.0749 6.4628 6.0360 4.9881 5.4479 5.1616 5.8573 2.2052 4.0332 4.7214 4.8018 5.6334 7.8174 5.0668 5.5055 6.2062 5.2522 3.8957 4.1896 6.1552 2.1482 5.2633 2.1512 4.8218 6.3022 3.5097 4.9520 1.2379 6.5200 3.1630 2.9764 8.9231 4.2218 1.1730 4.5770 3.5620 4.5564 6.9754 5.2472 5.8181 1.3159 6.8923 6.7460 9.1968 2.5815 4.0882 4.9142 7.0628 6.8472 6.7108 6.5814 2.0733 2.5180 1.8729 4.0944 6.0438 2.8739 1.2507 4.2625 3.7726 1.4618 3.5868 3.5702 1.7051 5.1007 1.3764 5.8853 2.2334 1.3211 1.9219 1.7173 3.7580 2.2905 2.7130 1.9493 2.1205 2.2917 2.3741 2.3759 1.4245 1.3334 1.5656 1.2772 1.7067 1.4861 1.8559 1.9830 1.4066 1.2871 1.7444 1.2659 1.3886 1.3396 1.3208 1.8634 1.3246 1.4453 8.4165 1.3159 1.5700 2.2247 2.0669 1.1247 4.2051 4.3620 6.1111 2.1131 6.4274 2.2543 8.1826 1.0845 1.0570 1.0864 1.0871 1.0885 1.1103 1.0867 1.0895 1.0935 1.0956 1.1009 1.0907 1.0984 1.0673 1.0453 1.0663 1.0665 1.1045
irintensity: 0.2556 2.7172 1.9644 3.5310 13.8660 1.0482 2.7458 2.2326 53.1392 13.7669 20.0970 19.2401 1.8623 1.9470 20.4850 10.4648 3.2646 7.3772 5.7298 19.5672 7.2526 55.9796 1.7364 26.7485 10.9848 32.0006 8.3284 26.3773 206.4440 11.0486 10.1235 0.8466 57.6456 1.7653 143.6741 27.6045 20.7110 3.5178 4.4095 1.8427 20.3861 114.6154 16.1034 8.0612 4.4158 32.9872 48.1652 68.8868 112.3484 17.5468 87.6106 54.3595 143.6652 33.9106 50.1745 2.0241 186.2270 48.2837 2.7540 26.5677 27.7821 27.2938 82.5438 135.8983 50.4747 200.0875 0.9934 0.3433 40.9218 2.7882 65.6839 30.7934 58.5708 33.5897 55.7169 26.2879 119.3542 81.7738 29.5194 2.2868 62.2568 5.6327 56.7024 51.0410 38.2134 46.1841 33.5199 7.2174 25.7777 4.9668 90.7393 3.9360 29.5489 5.7195 4.1527 58.0547 13.0359 29.5876 2.8945 10.9028 69.1375 9.4193 86.9278 7.8768 177.5296 87.7824 38.4943 140.8383 26.2810 338.8049 701.5077 18.3028 12.5002 12.4541 19.4217 5.2129 10.4863 0.9763 6.0488 5.2312 10.0326 8.6308 2.1235 3.7138 172.1230 117.7101 11.4114 108.5404 37.6483
temp: 298.150 k
press: 1.00000 atm
elementType: 15 8 8 8 8 8 8 8 8 7 7 7 6 6 6 6 6 6 6 6 6 6 6 6 6 6 6 1 1 1 1 1 1 1 1 1 1 1 1 1 1 1 1 1 1
symmnumber: 1
zpe: 868579.4 jmol-1
zpe.correction: 0.330824 hartree
zpe.thermalcorrener: 0.357752 hartree
zpe.thermalcorrenthalpy: 0.358696 hartree
zpe.thermalcorrgfe: 0.270518 hartree
zpe.sumelectzpe: -1687.628672 hartree
zpe.sumelectthermal: -1687.601745 hartree
zpe.sumelectthermalent: -1687.600800 hartree
zpe.sumelectthermalfe: -1687.688978 hartree
dipole: -1.0210 0.2414 -7.0066
dipole: 7.0848
quadrupole: -184.5810 -153.6232 -154.4916
quadrupole: -12.2196 -23.0990 4.7723
quadrupole: -20.3491 10.6088 9.7403 -12.2196 -23.0990 4.7723
hfenergy: -1687.9594964 hartree
pointgroup: C01 [X(C15H18N3O8P1)]
dipole: -0.6524134 -1.9267074 1.9056522 debye
polarizability: 260.6591093|-42.8740834|201.4368723|15.3563025|-7.0353145|233.705112 unknown
InChI: InChI=1S/C15H18N3O8P/c16-11-6-7-18(15(21)17-11)14-13(20)12(19)10(25-14)8-24-27(22,23)26-9-4-2-1-3-5-9/h1-7,10,12-14,19-20,22H,8,16H2
charge 0 multiplicity 1
45 atoms
P  -3.603353 1.349002 1.49539
O  1.397931 1.979786 0.251959
O  -0.06438 2.175796 -2.620635
O  0.317707 -0.806174 -0.36182
O  -2.280899 2.12254 0.749195
O  4.419891 0.365851 -1.750809
O  -3.27464 -0.363998 1.31037
O  -3.212117 1.476661 3.156274
O  -5.015772 1.868251 1.015039
N  2.932557 0.128522 0.058052
N  5.150308 -0.868196 0.112277
N  5.827393 -2.106425 1.950495
C  -0.275261 1.383325 -1.406325
C  0.761998 0.229245 -1.296245
C  -0.031838 2.201938 -0.11385
C  1.976505 0.957643 -0.667789
C  -0.871181 1.763829 1.094847
C  2.640774 -0.397632 1.297351
C  4.234101 -0.115598 -0.59578
C  3.567961 -1.160639 1.977781
C  4.844816 -1.370065 1.329653
C  -3.277321 -1.013747 0.042457
C  -3.974514 -0.522646 -1.084497
C  -2.539359 -2.218357 -0.012719
C  -3.901311 -1.249668 -2.295933
C  -2.487952 -2.937228 -1.229593
C  -3.160389 -2.450805 -2.377307
H  -1.31155 1.022738 -1.490003
H  1.010205 -0.18633 -2.289522
H  -0.181194 3.278563 -0.308564
H  2.568953 1.446028 -1.465049
H  -0.578513 2.326465 1.996484
H  -0.775923 0.677462 1.264427
H  0.819619 2.624357 -2.586606
H  -0.440466 -1.317894 -0.749136
H  1.655509 -0.163159 1.700795
H  3.338166 -1.568727 2.963603
H  -3.967471 1.35106 3.784254
H  5.692183 -2.519158 2.869007
H  6.713683 -2.22157 1.461033
H  -4.571634 0.393835 -1.019492
H  -2.038197 -2.577944 0.890986
H  -4.433735 -0.872348 -3.1753
H  -1.927584 -3.87731 -1.275683
H  -3.113102 -3.00618 -3.319272
