program: Gaussian 09
title: 000278495
version: EM64L-G09RevD.01
frameworkgroup: C1[X(C8H6O2)]
method: RPBEPBE
basis: SDD
operation: Freq
keyword: #p
keyword: freq=noraman
keyword: PBEPBE/SDD
title: #p freq=noraman PBEPBE/SDD
converged: NO YES NO NO
title: Mulliken charges:
elementType: O O C C C C C C C C H H H H H H
charge: -0.366745 -0.389551 0.216953 0.220979 -0.088107 -0.059722 -0.392545 -0.398302 -0.224621 -0.226583 0.259194 0.245683 0.222178 0.220956 0.379447 0.380786
chargesum: 0.00000
title: Mulliken charges with hydrogens summed into heavy atoms:
elementType: O O C C C C C C C C
charge: 0.012702 -0.008765 0.216953 0.220979 -0.088107 -0.059722 -0.133351 -0.152620 -0.002442 -0.005627
polarizability: 1.32131228e+02 -1.58569781e-01 1.04415606e+02 -4.92155752e-03 5.16032414e-04 3.69396707e+01
1716.lowfreq: -33.6774 -5.6410 -3.1497 -0.0004 0.0006 0.0008 5.2187 147.3723 156.2363
frequency: -33.4951 147.3716 156.2346 220.4921 227.9703 328.6252 371.5363 402.1735 475.2743 477.5586 534.8294 607.9769 628.7760 703.8571 737.1716 744.7791 791.2052 866.4361 898.0124 941.6797 959.7829 978.1258 1012.0484 1062.7929 1082.7018 1173.7899 1195.3953 1217.9688 1277.1676 1356.2436 1393.4267 1409.9301 1508.2340 1604.6802 1663.3539 1736.7279 3127.9567 3142.1060 3156.4954 3170.0145 3569.4992 3621.0526
redmass: 1.4416 4.5974 3.1704 5.0786 5.4713 2.2579 1.3344 4.2092 5.8829 7.6626 6.7468 4.7369 6.0542 6.9677 1.4262 3.0893 4.1245 1.3461 1.4141 5.0193 1.3052 2.3510 5.0228 2.1200 1.8208 1.0773 2.4017 1.4433 1.4450 3.4661 2.1962 1.9758 6.3416 8.0367 8.1671 9.2423 1.0851 1.0917 1.0955 1.0987 1.0658 1.0666
irintensity: 122.3800 0.0477 57.4607 2.4568 9.4768 69.9162 90.9773 0.0743 1.2237 9.1104 3.5399 0.2055 10.4575 28.7334 95.8354 24.5129 45.3352 0.2201 16.3186 66.1441 0.0052 27.2788 11.6945 23.1414 13.2418 4.1967 264.1821 174.6724 16.3465 86.1075 19.5813 3.1900 0.3402 6.0251 123.6999 83.6983 0.7359 20.5367 28.7019 12.4094 68.7231 82.6120
temp: 298.150 k
press: 1.00000 atm
elementType: 8 8 6 6 6 6 6 6 6 6 1 1 1 1 1 1
symmnumber: 1
zpe: 303142.4 jmol-1
zpe.correction: 0.115461 hartree
zpe.thermalcorrener: 0.123458 hartree
zpe.thermalcorrenthalpy: 0.124402 hartree
zpe.thermalcorrgfe: 0.082849 hartree
zpe.sumelectzpe: -458.097236 hartree
zpe.sumelectthermal: -458.089239 hartree
zpe.sumelectthermalent: -458.088295 hartree
zpe.sumelectthermalfe: -458.129849 hartree
dipole: 0.8302 2.2156 0.0003
dipole: 2.3660
quadrupole: -49.0304 -49.1652 -62.1006
quadrupole: 1.5298 0.0001 0.0003
quadrupole: 4.4017 4.2668 -8.6685 1.5298 0.0001 0.0003
hfenergy: -458.2126971 hartree
pointgroup: C01 [X(C8H6O2)]
dipole: 0.310909 -0.8774024 -0.0001174 debye
dipolederiv: -0.9842828 -0.7936325 -0.0000504 -0.8243305 -0.7831011 -0.0000205 -0.0000666 -0.0000398 -0.354593 -0.9201021 0.8227112 0.0000074 0.7865145 -0.9112657 0.0000536 -0.0000146 0.0000811 -0.3501806 0.3207392 -0.3003932 0.0000157 0.0550536 -0.0472445 -0.0000026 -0.0000123 -0.0000111 0.0149418 0.3599818 0.3244831 0.0000181 -0.0384735 -0.0850269 0.0000053 -0.0000171 0.00003 0.0275736 0.5711576 0.7856259 0.0000319 1.062825 0.6561278 0.000048 0.0000758 0.0000381 -0.030074 0.3362367 -0.8533021 -0.0000045 -1.0110104 0.6546195 -0.0000514 0.0000184 -0.0000536 -0.0796622 -0.1065616 0.0681983 0.0000088 0.1625763 0.0985914 0.0000069 0.0000162 0.000003 -0.1856966 -0.129601 -0.0713909 0.0000091 -0.1434829 0.0915227 -0.0000058 0.0000221 -0.0000022 -0.200545 0.0301974 -0.0008338 0.0000146 -0.1293505 -0.026887 -0.0000055 0.0000126 0.0000046 -0.1856936 0.0253935 0.0027294 0.000016 0.119202 -0.0428334 0.0000044 0.0000098 -0.0000069 -0.1913417 0.0892246 -0.0091443 -0.0000073 -0.0047956 -0.0822177 0.0000005 -0.0000055 -0.000001 0.1842794 0.0875753 0.0121651 -0.000007 -0.0022657 -0.1132638 -0.0000011 -0.0000058 -0.0000005 0.1860293 -0.0952697 0.0937897 -0.0000155 0.0972958 0.0334974 0.0000062 -0.0000156 0.0000049 0.1681949 -0.1043518 -0.0884035 -0.000016 -0.0925099 0.0376435 -0.0000058 -0.0000175 -0.0000041 0.1692601 0.2671535 0.1527789 0.0000064 0.1501082 0.2215534 -0.0000085 0.0000145 0.0000032 0.4173881 0.2525095 -0.1453814 -0.0000273 -0.1873565 0.2982844 -0.0000239 -0.0000144 -0.0000456 0.4101195 unknown
polarizability: 132.1279743|-0.3395821|104.4188599|0.00493|0.0004275|36.9396707 unknown
InChI: InChI=1S/C8H6O2/c9-7-5-3-1-2-4-6(5)8(7)10/h1-4,9-10H
charge 0 multiplicity 1
16 atoms
O  2.357064 1.679953 0.000185
O  2.453475 -1.665878 0.000157
C  -0.0828 0.703018 0.000083
C  -0.109593 -0.741988 0.000081
C  1.436989 0.653653 0.000133
C  1.423543 -0.733178 0.000123
C  -1.230743 1.465696 -0.000005
C  -1.284744 -1.465125 -0.000005
C  -2.48122 0.721784 -0.00008
C  -2.507554 -0.675456 -0.00008
H  -1.225301 2.559333 -0.000011
H  -1.33122 -2.559015 -0.000017
H  -3.425351 1.277953 -0.000139
H  -3.470862 -1.197816 -0.00014
H  3.28364 1.330659 0.000163
H  2.098279 -2.586395 0.000051
