program: Gaussian 09
title: 000025308
version: EM64L-G09RevD.01
frameworkgroup: C1[X(C24H19N5O7S)]
method: RPBEPBE
basis: SDD
operation: Freq
keyword: #p
keyword: freq=noraman
keyword: PBEPBE/SDD
title: #p freq=noraman PBEPBE/SDD
converged: YES YES NO NO
title: Mulliken charges:
elementType: S O O O O O O O N N N N N C C C C C C C C C C C C C C C C C C C C C C C C H H H H H H H H H H H H H H H H H H H
charge: 0.964353 -0.196458 -0.537029 -0.471758 -0.420040 -0.237898 -0.435708 -0.301158 -0.274860 -0.026792 -0.739091 -0.050436 -0.065394 -0.437977 0.232211 0.173220 -0.209542 0.345483 0.428248 0.179521 -0.200700 -0.762762 -0.435552 0.369386 -0.275293 -0.348774 -0.386134 0.095323 -0.346145 0.137981 -0.219657 -0.201853 -0.302526 -0.210059 -0.246648 -0.248053 0.156727 0.293283 0.311365 0.454580 0.255179 0.239945 0.252863 0.304835 0.292618 0.296696 0.279625 0.305057 0.275700 0.229620 0.228642 0.233425 0.230940 0.235544 0.399041 0.386884
chargesum: 0.00000
title: Mulliken charges with hydrogens summed into heavy atoms:
elementType: S O O O O O O O N N N N N C C C C C C C C C C C C C C C C C C C C C C C C
charge: 0.964353 -0.196458 -0.537029 -0.471758 -0.020999 -0.237898 -0.048824 -0.301158 -0.274860 -0.026792 -0.284511 -0.050436 -0.065394 -0.144694 0.232211 0.173220 -0.209542 0.345483 0.428248 0.179521 0.110665 -0.014775 -0.130718 0.369386 0.017325 -0.052078 -0.106509 0.095323 -0.041088 0.137981 0.009963 0.026789 -0.026827 0.023367 -0.015708 -0.012509 0.156727
polarizability: 6.93612759e+02 -1.50754523e+01 3.13156954e+02 -3.07600232e+01 4.38243935e+00 2.84075791e+02
1716.lowfreq: -6.9813 -2.8663 -1.1247 -0.0009 -0.0004 0.0007 5.3610 11.0797 12.2811
frequency: 4.6360 11.0777 12.1748 16.1830 25.5712 38.8878 43.5340 49.0392 63.5642 73.8797 91.5493 100.8262 103.8948 115.3181 125.4779 131.5622 137.2107 145.4910 149.3621 153.5801 173.1066 190.2816 204.3854 218.6043 224.6074 237.3264 251.2143 263.4958 264.0898 287.0618 299.8574 304.7494 337.9676 351.0367 367.9163 374.3661 380.2096 397.5736 407.3586 408.9773 414.7518 420.7601 441.7384 453.9650 504.4154 511.5880 516.9344 522.7960 547.6172 557.0602 572.2384 575.5222 583.6147 596.2405 606.5652 613.6040 613.8240 620.3094 645.9856 648.8673 667.1919 682.4063 698.1794 700.0493 712.6539 733.1379 749.6606 754.9313 760.2340 766.9881 770.4415 786.9600 791.0600 815.4066 847.0435 856.1157 877.3876 884.2746 888.6410 912.7755 933.5071 935.9357 942.9137 954.2734 975.6920 982.8745 986.0051 988.3612 989.1913 999.3619 1000.0750 1009.8249 1010.2518 1015.7405 1030.3019 1033.0579 1042.0160 1046.6207 1049.2357 1097.6377 1106.9140 1111.9022 1122.4147 1149.3279 1168.1730 1173.5228 1176.2030 1181.9533 1186.4164 1192.0202 1229.6340 1244.6079 1254.0543 1293.7612 1297.8676 1311.1190 1326.1764 1332.5608 1356.1181 1366.7793 1375.3983 1383.5388 1388.9922 1392.4151 1401.7577 1405.5637 1435.2564 1447.9946 1451.1988 1453.0176 1455.1248 1475.2390 1484.7484 1560.8551 1566.5571 1581.7121 1590.8246 1596.4353 1600.4763 1610.5238 1625.0153 1645.0103 1646.5908 2976.4564 2981.7334 3057.0640 3113.9443 3132.6417 3138.4304 3144.2374 3148.6967 3159.1065 3163.9051 3174.8834 3176.3240 3182.0340 3182.2584 3184.4305 3188.7970 3191.3105 3531.6292 3534.7802
redmass: 6.2619 6.3274 6.5319 7.3755 5.5453 7.4228 7.1986 5.2967 8.9388 8.8999 8.9942 4.9206 6.8072 5.3565 6.1047 7.5596 6.6065 3.7428 6.2598 1.2048 8.4967 7.7079 9.1011 7.1032 6.2510 5.4372 5.6084 6.8206 7.6347 6.6087 9.2928 8.5309 5.8361 8.6051 7.1467 5.9722 8.8744 7.3231 5.6260 3.0171 3.1252 6.7402 4.8942 9.6548 7.2829 3.4863 3.4330 4.9944 4.0393 4.3462 3.6655 1.3009 3.9984 5.8718 5.6284 3.6060 2.6731 3.5499 4.8110 5.7513 5.8902 4.3024 6.3618 2.1360 5.3136 4.5741 6.4433 2.5870 4.6311 1.3892 1.6230 1.8526 6.3217 6.3519 4.9641 1.2424 1.6606 3.0645 1.4099 4.5556 1.4365 3.8746 7.3310 1.6135 1.3691 2.2390 5.5765 1.3632 6.4519 1.3390 1.3046 3.7261 1.5458 3.4981 2.1992 3.1823 2.9746 2.2517 2.8076 1.6767 1.8567 1.5077 3.8384 1.3495 1.7464 1.0525 1.1272 1.4325 2.8221 1.1450 1.4424 1.3965 1.6313 3.3009 2.6195 1.5846 1.3520 2.7059 3.3727 2.5743 5.4658 9.2320 5.5352 9.6421 1.4267 5.9575 2.5041 2.3079 2.8519 1.0848 1.0897 2.3505 2.4215 7.1359 5.5259 6.1606 6.1474 6.8005 7.6835 5.9937 6.0529 12.1988 9.0222 1.0778 1.0411 1.0968 1.0986 1.0855 1.0874 1.0910 1.0897 1.0909 1.0974 1.0949 1.0942 1.0878 1.0934 1.0925 1.0939 1.0963 1.0643 1.0641
irintensity: 0.0404 0.6458 0.0026 0.0142 0.4778 0.3733 0.6321 0.5300 2.4074 2.6295 0.7219 0.4632 0.1155 2.4438 2.1309 0.9451 0.6060 3.0810 0.8252 1.1306 5.8128 6.0790 4.6762 0.8473 14.0112 4.3495 2.0264 3.3903 3.7192 2.1358 3.0693 0.9563 14.3839 7.7040 1.7927 8.5031 14.6691 29.5908 37.2290 1.6548 10.2079 30.9573 19.5974 132.9004 24.8643 12.6645 2.2460 12.6025 47.7713 15.3196 35.1701 96.8071 26.0648 50.9271 77.3678 34.4928 61.3269 47.3277 9.7574 14.6939 27.4620 37.4802 34.7554 36.4480 13.5901 42.4922 6.1024 34.1903 8.5044 162.8469 77.2513 5.6593 6.5127 74.7819 39.3777 0.4991 33.5962 2.0045 2.3701 44.7997 8.3025 51.9471 54.6526 24.5408 4.3496 45.1829 5.7436 0.0723 28.4276 2.1893 2.5770 263.4779 55.4623 10.6727 18.5623 263.3595 22.8719 51.1605 47.7792 38.8152 106.4463 127.3192 94.3862 32.4904 110.0193 0.0464 10.0197 21.4991 26.4382 3.4085 15.6224 12.1548 3.8251 401.6621 335.9311 33.3131 1.2461 97.8004 39.7540 92.3865 14.4263 1.4568 11.1008 29.2975 26.8435 52.8402 48.1404 7.7521 25.7515 22.1665 20.2176 275.6820 157.2469 1.7536 55.6912 9.4579 46.4270 18.5798 12.4778 59.8474 291.5532 169.7990 257.3909 18.7560 10.6368 9.2546 9.5142 0.5881 8.9323 20.7343 12.5703 12.2925 39.0526 0.2233 2.1791 171.8448 82.7823 2.0733 1.0781 7.5181 71.4604 72.1063
temp: 298.150 k
press: 1.00000 atm
elementType: 16 8 8 8 8 8 8 8 7 7 7 7 7 6 6 6 6 6 6 6 6 6 6 6 6 6 6 6 6 6 6 6 6 6 6 6 6 1 1 1 1 1 1 1 1 1 1 1 1 1 1 1 1 1 1 1
symmnumber: 1
zpe: 1038970.2 jmol-1
zpe.correction: 0.395723 hartree
zpe.thermalcorrener: 0.429587 hartree
zpe.thermalcorrenthalpy: 0.430531 hartree
zpe.thermalcorrgfe: 0.323812 hartree
zpe.sumelectzpe: -2121.515497 hartree
zpe.sumelectthermal: -2121.481633 hartree
zpe.sumelectthermalent: -2121.480689 hartree
zpe.sumelectthermalfe: -2121.587408 hartree
dipole: 1.5221 2.1674 6.2720
dipole: 6.8082
quadrupole: -202.4538 -202.1950 -222.4291
quadrupole: -8.6762 -7.8439 1.8197
quadrupole: 6.5722 6.8310 -13.4031 -8.6762 -7.8439 1.8197
hfenergy: -2121.9112203 hartree
pointgroup: C01 [X(C24H19N5O7S1)]
dipole: 0.7615923 1.571675 -2.0308934 debye
polarizability: 687.1004972|-49.5062515|293.785433|36.9174608|8.0886794|309.9595736 unknown
InChI: InChI=1S/C24H19N5O7S/c1-14-21(22(30)29(27-14)16-7-3-2-4-8-16)26-25-15-11-12-20(18(13-15)24(33)34)37(35,36)28-19-10-6-5-9-17(19)23(31)32/h2-13,21,28,31,33H,1H3
charge 0 multiplicity 1
56 atoms
S  -3.68414 -0.641921 1.392669
O  4.95468 -2.023742 0.132413
O  -3.380246 0.193496 2.759214
O  -4.191568 -2.172028 1.540258
O  -2.303182 -3.078543 -2.294677
O  -4.02935 -1.80582 -1.41106
O  -7.553671 1.9901 -2.447994
O  -5.711587 0.633341 -2.124946
N  6.186385 0.012467 -0.150697
N  6.007532 1.261588 -0.839719
N  -4.749043 0.395058 0.325032
N  2.803661 0.068008 -0.635363
N  1.898044 -0.675509 -1.199215
C  4.124338 -0.104863 -1.280848
C  4.848424 1.221169 -1.465481
C  5.104955 -0.869279 -0.332865
C  -2.007925 -0.586301 0.426874
C  -1.737358 -1.350717 -0.733553
C  7.394312 -0.185335 0.592076
C  0.59513 -0.585747 -0.585368
C  -1.020606 0.166242 1.08552
C  4.322493 2.377398 -2.254187
C  -0.409153 -1.348718 -1.223428
C  -5.795646 1.218114 0.774086
C  0.289933 0.17816 0.572821
C  7.607253 -1.387664 1.316928
C  8.37803 0.837375 0.592533
C  -6.726117 1.745289 -0.201306
C  -5.968009 1.587792 2.141348
C  -2.808586 -2.074927 -1.474446
C  8.80978 -1.552172 2.036833
C  9.571583 0.652033 1.319106
C  -7.772681 2.613545 0.219925
C  -7.018224 2.43955 2.52128
C  9.797162 -0.540924 2.044653
C  -7.929819 2.962229 1.568298
C  -6.592027 1.397311 -1.62199
H  4.030737 -0.678676 -2.226653
H  -1.288969 0.70675 1.999538
H  -4.799352 0.033015 -0.65473
H  5.039051 3.213644 -2.236402
H  4.132918 2.090621 -3.305738
H  3.358715 2.721677 -1.833857
H  -0.15417 -1.936785 -2.10883
H  1.083049 0.753104 1.059447
H  6.848237 -2.172494 1.312618
H  8.19506 1.755606 0.03073
H  -5.269493 1.210279 2.891106
H  -8.454401 2.997348 -0.543999
H  8.970781 -2.480924 2.595082
H  10.327548 1.444963 1.317031
H  -7.125403 2.701607 3.579916
H  10.7267 -0.67941 2.60687
H  -8.741641 3.626357 1.879472
H  -3.053342 -3.518068 -2.778429
H  -7.390984 1.690126 -3.381993
