program: Gaussian 09
title: 000278515
version: EM64L-G09RevD.01
frameworkgroup: C1[X(C13H23NO3)]
method: RPBEPBE
basis: SDD
operation: Freq
keyword: #p
keyword: freq=noraman
keyword: PBEPBE/SDD
title: #p freq=noraman PBEPBE/SDD
converged: NO YES NO NO
title: Mulliken charges:
elementType: O O O N C C C C C C C C C C C C C H H H H H H H H H H H H H H H H H H H H H H H
charge: -0.271629 -0.233219 -0.184051 0.068138 0.077761 -0.425263 0.350529 -0.599995 -0.373921 0.223884 -0.287252 -0.827134 -0.698308 -0.422063 -0.262147 -0.713492 -0.668241 0.234765 0.215791 0.288385 0.257776 0.217664 0.215043 0.221859 0.241161 0.227819 0.236378 0.218423 0.207946 0.216280 0.218541 0.213603 0.223836 0.239591 0.216193 0.219998 0.218460 0.221083 0.223026 0.252781
chargesum: 0.00000
title: Mulliken charges with hydrogens summed into heavy atoms:
elementType: O O O N C C C C C C C C C C C C C
charge: -0.271629 -0.233219 -0.184051 0.068138 0.077761 0.025293 0.350529 -0.053834 0.058787 0.223884 -0.065393 -0.121776 -0.055659 0.010081 0.201280 -0.058840 0.028650
polarizability: 1.75030982e+02 3.21663683e+00 1.63983402e+02 8.05110506e+00 -6.12714321e+00 1.43486010e+02
1716.lowfreq: -72.7201 -18.0067 -8.6532 -0.0003 -0.0001 0.0002 7.2822 8.3538 22.9942
frequency: -72.5208 -17.5257 22.5244 41.7460 52.3991 58.8266 72.9477 77.3483 89.3685 100.9754 111.5010 135.6003 150.5144 191.4730 204.3411 217.8925 231.9596 254.0731 275.9615 291.4304 302.1834 309.8668 325.5592 336.0498 361.2258 389.8721 424.5904 463.9396 491.5760 539.5436 591.4401 670.0532 714.5322 732.5425 746.2465 756.4232 788.1071 811.7411 818.7687 846.4410 850.5632 886.9763 895.9787 921.1778 960.5524 1007.4196 1010.0439 1026.5533 1040.2778 1058.5490 1063.9379 1073.3366 1078.2024 1094.2875 1104.1334 1117.3551 1137.4899 1156.2871 1169.9386 1200.8513 1207.3325 1251.7391 1253.2591 1279.2977 1284.5681 1294.1391 1303.5995 1310.8921 1352.5832 1354.4800 1360.4497 1390.5094 1391.6038 1393.4117 1395.4766 1414.2614 1416.7392 1452.1550 1455.1630 1458.1804 1465.3194 1472.9214 1474.7678 1478.2845 1479.9916 1481.5833 1483.3053 1486.5148 1490.9075 1614.6266 1656.7645 2950.2163 2969.6830 2972.1633 2973.0187 2975.5180 2979.6113 2989.9665 2990.4563 2992.9370 3022.4846 3032.2123 3049.6319 3064.8724 3071.9164 3074.3203 3074.8739 3076.8243 3080.0392 3086.4581 3095.0545 3100.9630 3113.5185 3121.0250
redmass: 1.1363 2.1448 3.4885 6.0623 3.2821 3.0263 3.6561 3.0957 1.9966 5.1725 3.0935 4.8752 2.8384 2.7474 1.5804 1.6221 1.1668 2.0762 1.9747 3.3694 2.9424 2.8317 2.6871 2.7925 4.7241 3.6705 3.1505 4.1003 2.8839 3.8119 2.8909 3.2763 3.2764 1.7716 1.2973 1.6416 1.8911 2.6590 1.9967 2.1760 1.3884 1.6430 2.2121 1.9022 2.1743 1.9940 2.3052 1.4868 2.5127 2.1859 2.5933 2.2611 1.5681 2.2062 2.5223 2.2921 2.0707 1.6739 4.2151 2.1270 2.0125 1.3912 1.1675 1.1172 1.3023 1.3544 1.1729 1.4406 1.4314 1.3005 1.4552 1.2316 1.2108 1.2020 1.2109 1.2256 4.8573 1.0721 1.0879 1.0769 1.0450 1.0582 1.0536 1.0450 1.0647 1.0411 1.0511 1.0527 1.0834 9.4110 7.5241 1.0598 1.0433 1.0505 1.0433 1.0592 1.0359 1.0984 1.0681 1.0361 1.0980 1.0595 1.0915 1.0982 1.1016 1.0995 1.1003 1.0978 1.0994 1.0974 1.1029 1.0967 1.0896 1.1064
irintensity: 0.0975 0.1239 0.9119 1.0420 0.4768 0.6360 0.6527 0.3100 0.2252 0.3951 0.0815 2.2286 0.3900 2.1571 0.7597 3.3823 0.1098 1.1593 3.3364 0.6564 0.9439 1.0576 12.8668 0.5751 11.2579 6.0448 6.5409 2.4874 4.1843 1.7079 11.2868 10.2346 7.9485 1.2103 7.2208 13.8954 12.9307 27.5870 5.2000 5.5007 3.2163 2.2304 7.9685 12.1816 1.6886 14.2593 27.0809 7.5703 20.4656 1.4979 34.5105 29.6716 13.6134 70.1550 86.0560 67.9851 37.5212 21.9889 75.1759 16.8619 45.1287 6.8008 0.2079 3.5880 7.6602 6.9814 0.2275 2.2111 2.2181 2.5801 7.2225 22.2799 9.0626 11.4463 23.3157 39.2836 63.1197 8.1492 5.5211 11.8167 15.5430 12.1907 13.2951 10.9953 9.3923 14.0210 10.3121 17.5955 22.8336 120.3201 6.8134 29.8296 16.1400 23.9774 25.9978 19.1616 39.5153 18.9199 18.9502 17.9604 8.3394 29.4084 20.2436 12.2048 10.5150 35.3455 53.2751 66.5133 40.5201 40.0104 1.8238 14.8720 22.5141 29.1466
temp: 298.150 k
press: 1.00000 atm
elementType: 8 8 8 7 6 6 6 6 6 6 6 6 6 6 6 6 6 1 1 1 1 1 1 1 1 1 1 1 1 1 1 1 1 1 1 1 1 1 1 1
symmnumber: 1
zpe: 887139.2 jmol-1
zpe.correction: 0.337893 hartree
zpe.thermalcorrener: 0.357852 hartree
zpe.thermalcorrenthalpy: 0.358796 hartree
zpe.thermalcorrgfe: 0.288208 hartree
zpe.sumelectzpe: -788.142507 hartree
zpe.sumelectthermal: -788.122549 hartree
zpe.sumelectthermalent: -788.121605 hartree
zpe.sumelectthermalfe: -788.192193 hartree
dipole: -0.4993 -2.8291 3.2502
dipole: 4.3378
quadrupole: -93.0832 -110.1960 -110.5488
quadrupole: -2.7661 4.7996 3.1097
quadrupole: 11.5261 -5.5866 -5.9395 -2.7661 4.7996 3.1097
hfenergy: -788.4804009 hartree
pointgroup: C01 [X(C13H23N1O3)]
dipole: -0.3021298 -1.0031382 1.347225 debye
polarizability: 175.6990451|2.377159|162.4759152|6.9645077|-8.1650153|144.3254341 unknown
InChI: InChI=1S/C13H23NO3/c1-5-8-11(4)13(9-6-2,10-14-16)12(15)17-7-3/h8H,5-7,9-10H2,1-4H3
charge 0 multiplicity 1
40 atoms
O  2.240979 -0.47356 0.563531
O  1.393364 -1.114109 -1.504458
O  0.226315 3.087724 -2.408959
N  0.677874 2.003328 -1.923115
C  0.060596 0.437683 -0.089036
C  0.440966 1.571938 0.924348
C  -1.00745 -0.52385 0.497577
C  -0.409721 1.071708 -1.426369
C  -0.726079 2.513772 1.294899
C  1.285008 -0.451476 -0.446321
C  -2.214333 -0.739158 -0.100354
C  -0.631315 -1.269706 1.771894
C  -0.31374 3.52837 2.383757
C  -3.286598 -1.683734 0.421331
C  3.446776 -1.329994 0.316875
C  -4.561341 -1.681523 -0.450113
C  3.173593 -2.790494 0.686213
H  1.27138 2.160545 0.485805
H  0.848407 1.119755 1.844551
H  -0.473477 0.275015 -2.19614
H  -1.369791 1.610459 -1.346774
H  -1.075932 3.068203 0.401508
H  -1.588115 1.91507 1.64929
H  -2.467896 -0.221652 -1.034843
H  0.182007 -0.774364 2.325338
H  -1.499601 -1.370947 2.446961
H  -0.282785 -2.295912 1.537736
H  -1.149719 4.204349 2.640362
H  0.00104 3.011734 3.310263
H  0.533314 4.154077 2.044845
H  -2.880966 -2.715426 0.480205
H  -3.554278 -1.41413 1.465207
H  4.216012 -0.874712 0.960617
H  3.728545 -1.230167 -0.745832
H  -5.011298 -0.672203 -0.492012
H  -5.322552 -2.374458 -0.048783
H  -4.333182 -1.993785 -1.486022
H  4.105533 -3.376881 0.582748
H  2.828064 -2.877173 1.731108
H  2.416298 -3.229515 0.015763
