program: Gaussian 09
title: 000278498
version: EM64L-G09RevD.01
frameworkgroup: C1[X(C9H12N2O2)]
method: RPBEPBE
basis: SDD
operation: Freq
keyword: #p
keyword: freq=noraman
keyword: PBEPBE/SDD
title: #p freq=noraman PBEPBE/SDD
converged: YES YES NO NO
title: Mulliken charges:
elementType: O O N N C C C C C C C C C H H H H H H H H H H H H
charge: -0.211836 -0.213460 -0.103526 0.026282 -0.481231 0.469420 -0.346758 -0.412586 -0.623539 -0.612730 -0.356088 -0.351970 0.369811 0.235388 0.200858 0.285151 0.245033 0.228078 0.243987 0.193511 0.227053 0.192191 0.228186 0.284373 0.284404
chargesum: 0.00000
title: Mulliken charges with hydrogens summed into heavy atoms:
elementType: O O N N C C C C C C C C C
charge: -0.211836 -0.213460 -0.103526 0.026282 -0.044986 0.469420 -0.061607 -0.167552 0.042036 0.034700 -0.071715 -0.067566 0.369811
polarizability: 1.83340560e+02 3.43782588e+00 1.19190586e+02 -7.16430403e+00 5.67300989e+00 6.95322822e+01
1716.lowfreq: -14.4060 -9.1093 -0.0006 -0.0005 -0.0004 3.7780 36.6987 57.9584 72.0227
frequency: 36.4991 57.9131 72.0065 87.4026 136.7979 211.7299 227.0898 234.6392 278.2689 294.3707 322.7716 353.3106 406.1584 412.3367 456.6114 488.6187 510.1988 624.4161 640.7838 669.5610 720.7389 765.3276 809.5551 832.0528 850.3709 871.0654 973.3766 992.9167 1005.1973 1015.6451 1036.5003 1037.9873 1090.7522 1092.3702 1105.3108 1134.4201 1168.2795 1172.6692 1205.7162 1222.2341 1263.1862 1273.2202 1296.6498 1345.7553 1367.4792 1404.9706 1419.2422 1421.0393 1441.1381 1456.5343 1461.7207 1473.5737 1477.8181 1478.6303 1487.6716 1595.9644 1608.2930 2839.9891 2862.7258 2875.5440 2989.0803 3022.4790 3031.2229 3080.7433 3088.5119 3132.8883 3154.0632 3180.5941 3182.9541
redmass: 4.2644 3.9232 4.8178 3.6491 4.5833 3.1248 1.3108 1.1816 3.4206 3.8465 3.4326 2.0012 2.9904 2.9384 3.5885 3.7590 5.8248 7.0045 6.0355 5.0870 3.7720 6.7042 4.6499 4.4425 1.4602 1.3304 1.6357 1.4768 2.8322 1.3869 2.0943 1.5794 1.2651 3.2002 1.3005 1.3850 1.7520 1.2683 2.7566 7.0790 1.9914 1.9265 1.3568 2.0193 4.3624 6.6204 2.7889 1.1420 1.2047 1.1009 1.0507 1.2157 1.1049 1.7302 1.0574 7.7733 6.2775 1.0701 1.0561 1.0564 1.0854 1.0737 1.0737 1.1013 1.1011 1.0905 1.0897 1.0944 1.0954
irintensity: 0.7228 0.2677 0.0302 0.7284 1.1721 2.7723 1.2083 0.3080 2.0744 2.6686 6.9305 4.9496 0.6978 0.3376 7.8353 5.4951 0.5970 0.1070 4.2357 20.3241 12.5386 19.3080 4.9577 12.0896 36.0484 24.1386 18.6864 0.4879 11.5690 0.3355 52.6135 26.8140 10.0806 14.7165 14.3712 6.7774 5.6238 28.8614 15.7957 337.6255 14.0265 1.1741 3.2612 24.2695 81.6728 2.0846 49.7842 4.0941 12.3149 15.8975 11.4219 20.7112 15.7502 0.6266 11.0977 1.1395 60.5118 57.1360 70.9997 223.2146 16.2419 39.0292 31.9845 24.7495 43.4364 10.7906 1.3835 0.1431 1.7566
temp: 298.150 k
press: 1.00000 atm
elementType: 8 8 7 7 6 6 6 6 6 6 6 6 6 1 1 1 1 1 1 1 1 1 1 1 1
symmnumber: 1
zpe: 522395.2 jmol-1
zpe.correction: 0.198970 hartree
zpe.thermalcorrener: 0.211581 hartree
zpe.thermalcorrenthalpy: 0.212525 hartree
zpe.thermalcorrgfe: 0.159104 hartree
zpe.sumelectzpe: -609.030992 hartree
zpe.sumelectthermal: -609.018381 hartree
zpe.sumelectthermalent: -609.017436 hartree
zpe.sumelectthermalfe: -609.070858 hartree
dipole: 6.7282 1.4815 -0.1109
dipole: 6.8903
quadrupole: -92.9770 -74.3146 -76.5879
quadrupole: -1.6279 0.8352 -0.4419
quadrupole: -11.6838 6.9786 4.7053 -1.6279 0.8352 -0.4419
hfenergy: -609.2299619 hartree
pointgroup: C01 [X(C9H12N2O2)]
dipole: -2.6482051 0.578837 -0.0247941 debye
dipolederiv: -0.6972535 0.2033864 0.0038653 0.2696899 -0.742773 0.0288386 0.0029276 0.0261714 -0.2354442 -0.8588156 -0.1836343 0.0387943 -0.2374927 -0.5993544 0.0369128 0.0440271 0.0384825 -0.2396676 -0.7457614 0.037936 -0.0047823 -0.0678608 -0.4886535 0.0305668 -0.1240202 0.0191788 -0.524437 1.9217577 -0.1175532 -0.0679033 -0.1460445 1.1068571 -0.0634889 -0.0698013 -0.0627346 0.2024973 0.3465327 0.0993535 0.1609458 0.2095857 0.4525165 -0.0094312 0.3970907 -0.0329828 0.1918652 0.4589662 -0.0482059 -0.0426028 -0.090041 0.0309968 -0.0119598 -0.189342 0.0182397 -0.003923 -0.3195803 0.1978233 -0.0201439 0.3206168 -0.0607378 -0.0184629 0.030622 -0.0169232 -0.1267121 -0.4227317 -0.1038847 0.0098457 -0.1867471 0.1135122 -0.0047878 0.018719 -0.0084854 -0.1553651 0.0689518 -0.0819769 0.0476006 -0.1298697 0.2694325 -0.0559726 0.1641195 -0.0683437 0.4429496 0.5790725 -0.0932342 -0.0786319 -0.1074118 0.2748859 -0.0796294 -0.1803406 -0.0722636 0.1510105 0.2563854 -0.1442876 -0.0016941 0.1499774 -0.0266673 -0.013079 -0.0387381 0.002885 -0.1031517 0.1937414 0.0585997 -0.0250563 -0.243641 -0.011889 -0.0020275 0.0102601 -0.0148693 -0.0955106 -0.7832748 0.1221281 0.0209769 0.1325427 0.0005618 -0.0046562 0.0517366 -0.0042324 0.0395124 -0.051587 0.0249064 0.0555623 -0.0525445 0.0736923 -0.0093489 0.0062214 -0.0376087 -0.1101914 -0.059568 0.0197219 -0.0451138 -0.0416171 -0.2351822 0.0251303 -0.0687487 0.1324858 0.0287353 0.1179895 -0.0752305 0.0286332 -0.0856624 0.0266363 0.0030984 0.0328422 0.0031812 0.1399775 0.053957 0.087066 0.0001226 0.072633 -0.0552586 0.0134248 -0.0030003 0.0174579 0.1437808 0.0051289 -0.1129173 -0.0940814 -0.1287984 -0.0698462 -0.0782375 -0.0485878 -0.0339704 0.0375591 -0.1031954 0.0354324 0.1145025 0.0492104 0.0820556 0.0222607 0.1132845 0.0143153 0.051473 0.0066377 0.0876931 -0.1006753 0.1463455 -0.1363657 0.1951199 -0.0551517 0.0312306 -0.1054874 -0.0436293 -0.0731132 -0.0151731 -0.1374648 -0.0741602 -0.0617345 -0.088895 -0.0855141 0.0823084 -0.1840701 0.0679523 0.0337699 0.2672132 -0.1434341 0.0478724 -0.0480615 0.0978941 0.0349007 0.080864 0.0095293 -0.0245034 0.0495536 0.0996237 -0.0113046 0.0511255 0.0168155 -0.1798556 0.1037001 0.0518717 -0.0031459 0.0208902 0.0411538 0.0097795 -0.0133507 0.0063312 0.1655995 0.0757824 -0.0693622 0.0088883 -0.0330626 0.0723976 0.0111166 0.0050618 0.0132593 0.1675763 unknown
polarizability: 183.7581417|-2.833884|119.7565481|-2.571899|-2.0792619|68.5487377 unknown
InChI: InChI=1S/C9H12N2O2/c1-10(2)7-8-3-5-9(6-4-8)11(12)13/h3-6H,7H2,1-2H3
charge 0 multiplicity 1
25 atoms
O  3.722678 -1.471461 0.130483
O  4.097292 0.77048 -0.055622
N  -3.248076 -0.355396 -0.150685
N  3.310947 -0.248338 0.064615
C  -2.41547 0.737081 0.392489
C  -0.917978 0.474736 0.261772
C  -0.411564 -0.849257 0.332642
C  -0.009256 1.5546 0.118057
C  -3.202413 -0.430386 -1.626204
C  -4.630299 -0.33183 0.368228
C  0.972087 -1.096824 0.268362
C  1.379667 1.329431 0.055805
C  1.852124 0.000796 0.132513
H  -2.656701 0.833198 1.470979
H  -2.655541 1.729647 -0.070039
H  -1.130259 -1.669479 0.429369
H  -0.392445 2.579688 0.052061
H  -3.759062 -1.32014 -1.969082
H  -2.157563 -0.530155 -1.967052
H  -3.644605 0.469977 -2.122196
H  -5.176312 -1.218397 -0.000023
H  -5.207058 0.576414 0.060341
H  -4.617712 -0.373299 1.47209
H  1.381745 -2.109001 0.322711
H  2.095471 2.148215 -0.054713
