program: Gaussian 09
title: 000278587
version: EM64L-G09RevD.01
frameworkgroup: C1[X(C18H18N8O6)]
method: RPBEPBE
basis: SDD
operation: Freq
keyword: #p
keyword: freq=noraman
keyword: PBEPBE/SDD
title: #p freq=noraman PBEPBE/SDD
converged: YES YES NO NO
title: Mulliken charges:
elementType: O O O O O O N N N N N N N N C C C C C C C C C C C C C C C C C C H H H H H H H H H H H H H H H H H H
charge: -0.404397 -0.231760 -0.280294 -0.418867 -0.227001 -0.191936 -0.423399 -0.388372 -0.046288 0.057965 -0.410188 -0.019888 -0.033663 -0.610603 -0.133911 -0.393681 -0.485092 0.114201 0.163540 -0.019167 -0.562960 0.493140 0.179716 0.269042 -0.228981 -0.359453 -0.503982 -0.158510 0.177594 -0.423279 0.002844 0.160157 0.303805 0.281844 0.248022 0.272798 0.257149 0.371190 0.263420 0.230260 0.319905 0.280207 0.238928 0.233214 0.258732 0.330095 0.385861 0.376715 0.321417 0.363906
chargesum: 0.00000
title: Mulliken charges with hydrogens summed into heavy atoms:
elementType: O O O O O O N N N N N N N N C C C C C C C C C C C C C C C C C C
charge: -0.018535 -0.231760 -0.280294 -0.042152 -0.227001 -0.191936 -0.052208 -0.068467 -0.046288 0.057965 -0.080093 -0.019888 -0.033663 0.074720 0.169894 0.136186 0.044855 0.114201 0.163540 -0.019167 -0.069280 0.493140 0.179716 0.269042 0.051226 -0.120525 -0.270768 -0.158510 0.177594 -0.164547 0.002844 0.160157
polarizability: 3.77155034e+02 6.40848278e+00 2.59678656e+02 -4.78774332e+00 1.90932528e+01 2.33390408e+02
1716.lowfreq: -3.7810 -0.5147 -0.0012 -0.0007 0.0006 5.2454 8.5039 10.9953 16.2169
frequency: 7.9056 10.8990 16.0780 17.5692 20.5505 32.6303 42.3156 47.0601 51.1653 58.9446 81.8485 90.1103 93.0735 116.7852 131.7303 144.4236 147.6955 183.6739 194.0683 198.1646 207.7105 241.7835 262.0112 284.3630 296.1358 312.4468 323.8861 327.4995 363.7294 374.5361 413.3243 419.3192 425.8448 430.6816 440.0632 466.1681 473.2119 499.0201 504.6988 512.7240 534.4146 540.2978 547.0836 556.9638 562.2235 581.2241 587.3449 608.0296 614.6104 629.7391 631.4328 637.3446 648.7645 649.0329 683.6816 687.8544 698.4312 721.2271 737.2444 746.4591 766.0066 783.4495 789.2637 816.0601 820.2585 836.2139 851.6068 875.6055 878.7779 900.6555 909.7363 923.9912 938.4710 970.7748 980.9403 988.1604 994.8849 1022.6736 1023.9105 1039.9622 1061.5876 1081.7371 1093.0568 1108.3854 1117.2781 1127.6514 1163.8506 1183.7912 1189.0207 1207.2513 1219.0419 1240.2762 1244.3514 1257.5827 1262.7800 1271.5925 1280.3878 1285.4442 1295.9127 1301.3372 1330.9610 1333.3190 1351.0541 1358.1570 1361.0108 1370.3473 1379.2082 1384.7527 1437.4255 1440.0764 1455.4994 1465.7963 1466.5926 1469.5963 1494.4526 1499.7224 1514.6932 1533.9046 1562.4002 1590.6100 1592.0797 1598.9145 1599.0207 1644.8380 1655.4673 1669.7859 2991.9797 3002.2745 3013.6992 3033.9182 3041.0589 3075.9756 3099.4204 3131.1800 3134.7237 3145.8083 3173.7685 3455.4512 3508.0026 3513.9801 3519.0804 3537.1605 3547.0735 3698.2983
redmass: 7.4962 7.9476 9.0462 11.1570 9.5954 6.4421 6.8225 9.4286 7.1386 6.1154 6.7540 3.1566 4.2968 6.5958 7.3777 5.8644 5.2766 7.4849 4.6123 6.3096 4.7086 6.1414 3.7593 5.8226 3.9960 1.2365 4.5653 4.3533 3.4702 4.9112 4.9449 3.5753 4.8754 4.3343 7.4085 4.2972 6.8584 3.3285 1.8473 2.7165 3.1382 3.4527 2.4256 1.2822 2.4432 4.5613 4.9978 4.6662 3.5210 1.6619 1.6799 1.3503 6.2171 5.6594 3.7883 6.6716 9.3150 3.5307 6.1484 1.2396 2.0708 3.0841 5.2349 6.8400 5.5551 6.2190 1.6235 4.1500 1.4659 4.5261 4.2042 1.6917 2.7302 2.9717 2.6111 1.3392 2.6073 2.7730 2.8053 2.8316 2.1734 4.5455 2.6025 2.3375 3.9471 1.5093 1.5574 3.2196 1.6658 1.6673 1.3726 1.5635 2.4729 1.8714 3.4584 1.6212 2.0129 1.1898 1.7459 2.3969 2.6668 1.5720 2.7669 1.9349 2.4407 2.1068 1.8186 2.5960 6.1094 1.1093 2.6797 1.4007 1.0968 1.7395 1.8801 4.5443 8.5821 4.5416 3.4950 5.1684 4.2584 4.9978 2.6003 2.8363 8.7891 8.2163 1.0606 1.0815 1.0621 1.0613 1.0981 1.1016 1.1039 1.0904 1.0902 1.0931 1.0957 1.0773 1.0778 1.0639 1.0642 1.0764 1.0457 1.1054
irintensity: 0.6523 0.5762 8.6654 0.2458 1.0163 1.0105 1.4194 1.0338 2.3726 1.0411 0.0864 3.9323 6.2659 2.5295 1.9560 5.5832 0.6043 4.2497 0.7908 13.8601 2.3421 1.4395 9.8227 0.7338 1.9000 57.9690 0.7299 2.7136 1.0182 3.7783 29.3825 1.6547 30.4653 2.0282 5.3638 3.5877 3.2751 10.5631 44.9057 96.6413 59.4678 21.4564 61.3213 243.1936 82.0607 31.0104 11.2246 7.1888 25.8689 61.5403 70.4195 120.8741 6.7417 6.1883 33.9515 6.2951 23.0717 6.9252 1.4622 129.7233 20.3037 32.0450 16.3838 9.7717 0.5811 10.4513 45.4061 9.9940 8.5711 19.0451 12.0813 6.9188 4.5878 7.8921 8.4829 0.1788 12.3819 56.8676 135.2031 250.9378 146.5822 52.0215 27.9059 19.6134 15.3754 48.3935 9.7797 36.9388 12.0621 34.1101 8.0824 9.3893 9.0614 13.3900 17.2390 19.2456 53.3257 23.6579 2.7206 62.6199 144.6228 34.9706 112.7493 32.1761 54.4706 109.0602 77.4493 7.4736 270.0060 31.9160 103.2597 67.8415 30.3411 346.6025 330.5451 71.3501 68.5773 37.7833 6.5888 589.9458 209.1845 141.2083 240.0644 492.1167 146.3510 217.6495 10.7413 16.3454 29.3143 11.7884 4.5100 8.0428 11.5523 10.0929 49.5900 14.5770 2.3910 56.6665 35.0455 21.3553 34.9811 51.4433 162.6543 50.1071
temp: 298.150 k
press: 1.00000 atm
elementType: 8 8 8 8 8 8 7 7 7 7 7 7 7 7 6 6 6 6 6 6 6 6 6 6 6 6 6 6 6 6 6 6 1 1 1 1 1 1 1 1 1 1 1 1 1 1 1 1 1 1
symmnumber: 1
zpe: 963924.0 jmol-1
zpe.correction: 0.367139 hartree
zpe.thermalcorrener: 0.396796 hartree
zpe.thermalcorrenthalpy: 0.397741 hartree
zpe.thermalcorrgfe: 0.299022 hartree
zpe.sumelectzpe: -1583.817462 hartree
zpe.sumelectthermal: -1583.787805 hartree
zpe.sumelectthermalent: -1583.786860 hartree
zpe.sumelectthermalfe: -1583.885579 hartree
dipole: 5.2516 6.1113 6.7793
dipole: 10.5302
quadrupole: -175.5538 -154.3400 -194.0296
quadrupole: 36.8700 2.6350 -11.2253
quadrupole: -0.9126 20.3011 -19.3885 36.8700 2.6350 -11.2253
hfenergy: -1584.1846011 hartree
pointgroup: C01 [X(C18H18N8O6)]
dipole: -2.3117033 -1.3747857 -3.1511404 debye
polarizability: 376.1898253|-14.5045082|224.6935952|-1.6370155|3.9099412|269.3406775 unknown
InChI: InChI=1S/C18H18N8O6/c19-18-25-14-13(16(30)26-18)23-9(7-22-14)6-20-8-1-2-10(21-5-8)15(29)24-11(17(31)32)3-4-12(27)28/h1-2,5,7,11,20,24-25,27,31H,3-4,6,19H2
charge 0 multiplicity 1
50 atoms
O  5.81349 1.613861 -3.371398
O  3.959901 0.21903 -3.266271
O  3.740896 2.153775 1.277495
O  7.620244 -2.682815 -0.061182
O  8.311589 -0.628607 0.770077
O  -6.184174 1.266614 2.429172
N  3.614193 0.744022 -0.581435
N  -1.665626 -1.278375 2.334547
N  1.314578 -0.363185 0.291261
N  -4.302329 -0.581179 1.26346
N  -6.135313 0.696002 -1.653174
N  -4.394881 -0.890595 -1.568179
N  -7.034294 1.781288 0.308607
N  -7.876544 2.288087 -1.805273
C  4.821903 1.283366 -1.200491
C  6.137208 0.754093 -0.543963
C  6.2691 -0.775872 -0.631412
C  4.780141 0.968677 -2.690646
C  3.146468 1.236888 0.619228
C  1.870766 0.600411 1.087295
C  -2.470554 -2.183923 1.506711
C  -0.509374 -0.632024 1.907462
C  7.491683 -1.291858 0.099334
C  -3.457124 -1.43585 0.613483
C  1.272556 1.000696 2.307641
C  0.082437 0.385557 2.71964
C  0.162202 -0.955421 0.683709
C  -5.195215 0.127071 0.522483
C  -5.222773 -0.040845 -0.899881
C  -3.512966 -1.5872 -0.797841
C  -6.160337 1.090169 1.183738
C  -7.005432 1.585654 -1.005228
H  4.830971 2.383929 -1.072428
H  6.123531 1.076291 0.510893
H  6.997802 1.247097 -1.028257
H  5.37838 -1.269199 -0.195557
H  6.327909 -1.131909 -1.678438
H  3.035443 0.049722 -1.072566
H  -3.045405 -2.837485 2.187979
H  -1.815593 -2.838976 0.908144
H  -2.169166 -0.854717 3.117165
H  1.757945 1.783845 2.896785
H  -0.398095 0.678386 3.660564
H  -0.238243 -1.711795 0.000691
H  -2.840605 -2.271004 -1.326225
H  -6.123684 0.553385 -2.667292
H  5.770043 1.382386 -4.338606
H  8.42466 -2.993024 0.437306
H  -7.909793 2.203709 -2.817968
H  -8.503318 2.933449 -1.32866
