program: Gaussian 09
title: 000278482
version: EM64L-G09RevD.01
frameworkgroup: C1[X(C9H11NO2S)]
method: RPBEPBE
basis: SDD
operation: Freq
keyword: #p
keyword: freq=noraman
keyword: PBEPBE/SDD
title: #p freq=noraman PBEPBE/SDD
converged: YES YES NO NO
title: Mulliken charges:
elementType: S O O N C C C C C C C C C H H H H H H H H H H H
charge: 0.188704 -0.338293 -0.283134 -0.374167 0.365491 -0.173843 -0.247907 -0.418157 -0.271178 -0.186828 0.297308 -0.864205 -0.607053 0.314335 0.253685 0.243183 0.229856 0.332774 0.272710 0.258408 0.272515 0.271923 0.231907 0.231966
chargesum: 0.00000
title: Mulliken charges with hydrogens summed into heavy atoms:
elementType: S O O N C C C C C C C C C
charge: 0.188704 -0.338293 -0.283134 -0.041393 0.365491 -0.173843 0.066428 -0.164471 -0.027994 0.043028 0.297308 -0.060572 0.128743
polarizability: 1.80726178e+02 4.36353971e+00 1.54001558e+02 4.72985131e-02 3.41714707e-03 5.98531391e+01
1716.lowfreq: -8.2498 -5.0195 -0.0025 -0.0023 -0.0018 4.1703 27.0577 41.1479 52.3888
frequency: 27.0243 41.1270 52.3863 85.5828 97.3150 150.7854 165.6276 172.1637 223.6976 239.9076 257.4213 317.9206 337.1812 348.5629 418.2360 437.6279 562.0415 590.0852 598.2407 648.3006 672.0679 681.7038 687.2730 696.0245 782.0246 824.8167 881.4176 903.8898 906.7256 965.4619 968.9933 979.6728 992.8538 1073.7244 1086.9138 1093.3941 1126.1662 1145.4421 1169.4008 1182.5780 1207.9820 1293.6871 1350.9129 1380.8961 1415.9284 1430.0834 1452.4177 1453.2760 1460.4942 1468.8922 1483.6831 1512.9865 1588.1808 1591.9419 1685.7766 2982.0113 3010.4460 3060.5299 3114.7577 3129.1466 3135.3103 3135.3673 3154.8026 3176.3479 3209.7506 3578.0364
redmass: 5.3534 4.1673 3.9963 4.5905 1.0947 2.8966 3.0280 3.8438 1.6203 2.9367 4.2941 6.5869 4.3202 7.0224 6.5969 3.1359 4.4367 1.1502 6.8734 7.4820 7.2719 3.7062 3.9779 6.6099 1.4798 5.7846 1.3748 1.3739 4.8867 1.2478 1.2502 4.5546 1.3995 2.6475 2.7660 1.6262 1.2836 1.7097 1.4559 1.9943 2.5407 1.3117 1.1472 8.0021 2.7962 1.1721 1.5551 1.0511 1.2622 1.4099 1.0437 1.3744 6.5267 6.5502 9.1006 1.0353 1.0290 1.1027 1.0983 1.1062 1.0946 1.0944 1.0941 1.0975 1.0913 1.0773
irintensity: 6.7069 0.0049 6.1089 1.3273 0.2623 0.9932 0.5592 3.0356 0.0555 0.1255 3.1024 0.4602 16.5338 7.6689 2.9318 3.5247 7.1999 126.8787 0.2133 7.3947 0.2520 0.1628 59.8372 6.4180 60.4903 34.8610 0.7368 25.1394 74.2736 3.3097 8.2984 0.8412 7.1609 70.2279 145.0127 8.9191 0.0105 114.8301 195.3013 390.5086 10.9465 39.6597 1.6318 0.5501 61.2945 40.5108 246.2808 15.0170 95.7871 16.6961 15.8331 176.6517 115.1803 38.8588 261.1439 82.6470 19.3030 35.8015 3.7881 15.2841 12.5509 3.4940 15.2836 8.2325 8.1377 46.9445
temp: 298.150 k
press: 1.00000 atm
elementType: 16 8 8 7 6 6 6 6 6 6 6 6 6 1 1 1 1 1 1 1 1 1 1 1
symmnumber: 1
zpe: 484819.1 jmol-1
zpe.correction: 0.184658 hartree
zpe.thermalcorrener: 0.198491 hartree
zpe.thermalcorrenthalpy: 0.199435 hartree
zpe.thermalcorrgfe: 0.142118 hartree
zpe.sumelectzpe: -951.857319 hartree
zpe.sumelectthermal: -951.843486 hartree
zpe.sumelectthermalent: -951.842542 hartree
zpe.sumelectthermalfe: -951.899859 hartree
dipole: 3.5930 0.7716 0.0134
dipole: 3.6750
quadrupole: -66.7069 -75.1520 -88.2237
quadrupole: 2.4472 0.0436 -0.0196
quadrupole: 9.9873 1.5422 -11.5295 2.4472 0.0436 -0.0196
hfenergy: -952.0419769 hartree
pointgroup: C01 [X(C9H11N1O2S1)]
dipole: 1.4127037 -0.2828211 -0.1214268 debye
dipolederiv: -0.1762114 0.3237582 0.0418294 0.2528922 -0.4065378 -0.0502239 0.0333708 -0.0541408 -0.1062067 -2.0801093 -0.5521846 0.0475151 -1.1506515 -0.8577691 -0.0076769 -0.0213684 -0.043044 -0.210456 -0.8726122 0.1042721 0.0450367 0.0169911 -0.9135301 -0.0700516 0.0348916 -0.0748815 -0.3520504 -1.6158807 -0.0953988 0.0555997 -0.0169757 -0.358413 0.0194377 0.0673399 0.0246725 -0.5180271 1.6754939 0.3407019 -0.0532547 0.1927659 0.3506065 0.0152487 -0.0715851 0.0061734 0.1191198 0.4426164 -0.5291211 -0.0910186 -0.6131227 0.6836396 0.1222374 -0.1003463 0.1174345 -0.0494614 -0.6433194 0.1924225 0.0516719 0.2102099 -0.2544595 -0.0252431 0.0536233 -0.0237968 -0.1488416 -0.4020152 -0.0388674 0.0062858 -0.2374037 -0.1930229 0.017006 -0.0163564 0.0051744 -0.2168649 -0.1186826 0.1263865 0.0121337 0.2715387 -0.422709 -0.0465483 0.0288589 -0.0381115 -0.1619377 0.2898908 -0.0846496 -0.0351177 -0.0181351 0.1741746 0.0369096 -0.0276736 0.0408973 -0.1329936 2.6418113 0.1437009 -0.125139 0.7414188 1.4942609 0.0956562 -0.0570071 0.130154 0.3424598 -0.0274784 0.0759671 0.0141205 0.0836779 0.1374283 0.0034649 0.0151404 0.0036791 0.0644468 0.4546471 0.1560559 0.0082215 0.4567462 0.1751927 -0.039278 0.0431428 -0.0210699 0.2692137 0.2380579 -0.018196 -0.0062178 -0.0103561 0.0488501 -0.0127745 -0.004995 -0.0124733 0.1660134 0.0220526 0.0950633 0.0204901 0.0875714 0.0204391 -0.0238129 0.019685 -0.0242885 0.1796549 -0.0836049 -0.0349865 0.0110149 -0.0069917 0.1077034 -0.0065113 0.0142657 -0.0049228 0.1670804 0.0505704 -0.0662521 -0.001272 -0.0671645 -0.1122599 -0.0267607 -0.0013821 -0.0268231 0.1537301 0.2049772 -0.0284818 0.0070725 -0.0892457 0.1347542 -0.0231898 -0.0004148 -0.026702 0.3715256 0.007251 -0.1011027 -0.1233985 -0.0241944 0.0354533 0.0148209 -0.0932542 0.0179994 -0.0146668 0.0233858 0.1007644 0.0179099 0.093209 -0.0501066 -0.0263856 0.0170865 -0.0268433 0.1281786 0.0299426 -0.1264077 0.0917394 -0.0448553 0.0379279 0.0042845 0.0797905 0.0105526 -0.0401354 0.1321943 0.1136097 0.0133589 0.0012294 -0.0013524 -0.0159217 -0.0000334 -0.0227708 0.1302994 -0.0804438 -0.0605858 0.0938333 -0.0867408 0.0907642 -0.0186817 0.1602617 0.0168171 -0.0915775 -0.1125333 -0.0364686 -0.1024149 -0.0424132 0.0789653 0.0639942 -0.1730408 0.026314 -0.0485032 unknown
polarizability: 180.3571034|-3.3489025|152.6689065|-7.5620998|10.8773352|61.5548654 unknown
InChI: InChI=1S/C9H11NO2S/c1-10-9(11)12-7-4-3-5-8(6-7)13-2/h3-6,10H,1-2H3
charge 0 multiplicity 1
24 atoms
S  -3.47351 1.286393 0.459601
O  1.470039 -0.754298 -0.067928
O  1.707398 1.613316 0.198762
N  3.526262 0.155496 -0.087637
C  0.050708 -0.863159 0.004702
C  -2.221578 -0.035154 0.234357
C  -0.832247 0.226827 0.181562
C  -0.4170 -2.189162 -0.11908
C  -2.715687 -1.358881 0.112439
C  -1.807557 -2.424438 -0.063325
C  2.193126 0.467234 0.032268
C  -2.417095 2.832996 0.575165
C  4.573252 1.178026 -0.028227
H  -0.424769 1.233015 0.272251
H  0.300632 -3.002783 -0.254738
H  -3.792766 -1.552638 0.154424
H  -2.186941 -3.447525 -0.157693
H  3.76595 -0.827258 -0.219866
H  -1.740443 2.780124 1.441909
H  -3.129353 3.661314 0.711908
H  -1.845776 2.985892 -0.353302
H  4.087065 2.155553 0.11666
H  5.15659 1.208509 -0.966843
H  5.262203 0.996602 0.817131
