program: Gaussian 09
title: 000278494
version: EM64L-G09RevD.01
frameworkgroup: C1[X(C11H16N2O5)]
method: RPBEPBE
basis: SDD
operation: Freq
keyword: #p
keyword: freq=noraman
keyword: PBEPBE/SDD
title: #p freq=noraman PBEPBE/SDD
converged: NO YES NO NO
title: Mulliken charges:
elementType: O O O O O N N C C C C C C C C C C C H H H H H H H H H H H H H H H H
charge: -0.432643 -0.435985 -0.416897 -0.215665 -0.213177 -0.141689 0.015371 -0.469596 -0.377300 -0.378983 0.344617 -0.312997 -0.328593 0.094070 -0.482890 0.388442 -0.340829 -0.367216 0.240806 0.238102 0.190019 0.233787 0.226613 0.214212 0.235956 0.185565 0.212348 0.217297 0.318972 0.231048 0.288737 0.331885 0.337213 0.369402
chargesum: 0.00000
title: Mulliken charges with hydrogens summed into heavy atoms:
elementType: O O O O O N N C C C C C C C C C C C
charge: -0.100759 -0.098773 -0.047495 -0.215665 -0.213177 -0.141689 0.015371 0.009313 0.046505 0.061842 0.344617 0.108525 0.101052 0.094070 -0.163918 0.388442 -0.109782 -0.078478
polarizability: 1.90052914e+02 8.57103427e+00 1.75460706e+02 2.84122598e+00 2.58985709e+01 1.11945940e+02
1716.lowfreq: -10.6165 -5.8520 -4.0137 -0.0005 -0.0003 0.0002 18.2945 29.0995 40.0080
frequency: 17.9659 29.0518 39.9941 50.4694 57.6935 79.8868 89.6831 109.3194 120.7870 155.5223 203.5816 214.1853 223.0500 247.7760 291.0703 298.0754 306.7142 314.8413 335.2445 349.2107 381.0029 412.5230 422.3215 445.4073 488.5435 506.7123 534.3738 553.5585 581.9800 623.9494 682.9355 733.9870 748.0228 789.3828 795.8718 800.1766 816.2374 857.8442 912.9153 939.0267 957.2231 963.4619 965.4846 992.9374 1025.7472 1043.6692 1052.0653 1057.0247 1065.9813 1096.2053 1105.4841 1126.2031 1153.4648 1187.8760 1189.5246 1214.5133 1234.1466 1250.5811 1257.7063 1271.4768 1279.8059 1292.6839 1305.8511 1314.2886 1345.6821 1360.2416 1361.1401 1363.5921 1383.0994 1389.4852 1422.7187 1429.1453 1457.5378 1466.2706 1469.0188 1478.8395 1484.0144 1489.6433 1602.4716 1613.5839 2858.6792 2893.5897 2912.3334 2957.4511 2981.4088 3006.6380 3020.5689 3056.1182 3083.4425 3101.0040 3127.6792 3179.1014 3187.3241 3557.8446 3567.1706 3576.5590
redmass: 6.6968 5.8208 6.8008 5.4717 10.0301 1.9274 2.2468 7.1260 3.6629 4.3814 3.7654 2.5259 5.6780 3.5322 2.1235 1.3156 1.4141 5.1263 2.9512 10.4728 3.4454 1.1995 3.5764 2.9561 4.5996 5.4976 4.1180 3.8865 5.1555 7.9517 4.8652 4.6989 9.6882 2.6098 1.3501 1.2700 1.4908 4.4184 4.6977 1.7264 3.9630 3.4119 1.4182 1.7159 2.2756 1.7949 2.8728 2.1667 2.2488 1.8509 1.5149 1.7963 1.1935 1.5095 2.2825 4.4076 2.0049 2.2697 1.8130 1.2901 1.2280 1.1435 1.3616 1.2945 1.2438 1.4535 2.4007 2.1995 1.3137 1.3648 6.0673 3.2069 1.1457 1.0720 1.0845 1.1101 1.0935 2.7971 7.1263 7.5348 1.0717 1.0701 1.0678 1.0701 1.0665 1.0872 1.0916 1.0874 1.0990 1.0960 1.0908 1.0913 1.0947 1.0662 1.0664 1.0661
irintensity: 0.5182 0.1250 1.4403 0.7007 0.0623 5.3141 9.0402 1.3730 5.9529 2.0315 0.6389 2.6554 9.4792 2.4906 57.0801 84.9886 87.1926 7.5962 42.7248 0.4266 28.9153 140.7021 9.4013 0.9056 3.2382 3.2756 4.8141 9.6337 13.6072 13.5558 19.3412 3.8086 5.4107 7.2002 11.7764 15.3786 42.3905 4.5804 16.9287 13.6957 131.3255 101.0395 1.5849 48.8577 21.1873 32.2491 14.2713 46.6750 27.4842 84.1072 73.4411 1.8931 15.4773 21.6192 14.5572 481.1997 17.7284 71.5013 30.7618 21.3349 3.0202 3.9256 17.4400 21.0016 27.4555 7.3110 84.4896 30.9743 0.4511 1.4050 29.8812 21.3374 15.2538 4.4181 1.7008 7.7507 4.9921 35.2377 67.7578 33.6378 94.8564 32.7076 74.1344 68.3835 53.2220 13.8890 24.0054 18.0465 44.4335 21.6520 12.6983 8.6545 2.5343 8.0828 8.1514 63.8746
temp: 298.150 k
press: 1.00000 atm
elementType: 8 8 8 8 8 7 7 6 6 6 6 6 6 6 6 6 6 6 1 1 1 1 1 1 1 1 1 1 1 1 1 1 1 1
symmnumber: 1
zpe: 700698.8 jmol-1
zpe.correction: 0.266882 hartree
zpe.thermalcorrener: 0.285890 hartree
zpe.thermalcorrenthalpy: 0.286834 hartree
zpe.thermalcorrgfe: 0.217032 hartree
zpe.sumelectzpe: -912.877648 hartree
zpe.sumelectthermal: -912.858640 hartree
zpe.sumelectthermalent: -912.857696 hartree
zpe.sumelectthermalfe: -912.927498 hartree
dipole: 1.1664 -7.9449 -3.7762
dipole: 8.8737
quadrupole: -118.3438 -104.9706 -113.9168
quadrupole: -7.1943 -7.0751 0.4415
quadrupole: -5.9334 7.4398 -1.5064 -7.1943 -7.0751 0.4415
hfenergy: -913.1445302 hartree
pointgroup: C01 [X(C11H16N2O5)]
dipole: 0.2400222 -3.2417612 -1.2734275 debye
polarizability: 191.0900373|8.8553923|177.8562175|0.3727245|20.7667709|108.5133047 unknown
InChI: InChI=1S/C11H16N2O5/c14-5-3-12(4-6-15)8-9-7-10(13(17)18)1-2-11(9)16/h1-2,7,14-16H,3-6,8H2
charge 0 multiplicity 1
34 atoms
O  -4.649102 -0.362479 2.477527
O  -2.182002 3.082132 -2.426436
O  0.537838 -3.333503 -1.053447
O  4.098646 1.623997 0.829858
O  1.999191 2.499056 1.008199
N  -2.005843 -0.025335 -0.237133
N  2.812111 1.532652 0.731383
C  -1.242768 -1.286325 -0.337575
C  -3.353625 -0.198728 0.354219
C  -1.985892 0.787175 -1.480969
C  0.266795 -1.088975 -0.253651
C  -3.308386 -0.194359 1.897334
C  -2.086282 2.29992 -1.184992
C  1.145624 -2.148494 -0.621105
C  0.836472 0.113142 0.198966
C  2.240335 0.252138 0.270292
C  2.553854 -2.005795 -0.541745
C  3.112341 -0.796781 -0.09366
H  -1.476344 -1.852543 -1.270725
H  -1.550449 -1.95163 0.49277
H  -3.845427 -1.139312 -0.002975
H  -4.003805 0.63286 0.031158
H  -2.804482 0.506646 -2.184266
H  -1.0306 0.591239 -2.005584
H  -2.961183 0.785492 2.25942
H  -2.610134 -0.972118 2.274705
H  -1.229066 2.623121 -0.559387
H  -3.017122 2.534338 -0.642746
H  0.177989 0.930796 0.502068
H  3.209154 -2.837385 -0.829397
H  4.192964 -0.651353 -0.022873
H  -5.008645 -1.247382 2.214253
H  -1.310224 3.056011 -2.89515
H  1.208768 -4.01742 -1.30154
