program: Gaussian 09
title: 000278475
version: EM64L-G09RevD.01
frameworkgroup: C1[X(C15H17NO)]
method: RPBEPBE
basis: SDD
operation: Freq
keyword: #p
keyword: freq=noraman
keyword: PBEPBE/SDD
title: #p freq=noraman PBEPBE/SDD
converged: YES YES NO NO
title: Mulliken charges:
elementType: O N C C C C C C C C C C C C C C C H H H H H H H H H H H H H H H H H
charge: -0.447561 -0.305008 -0.364903 -0.572764 -0.454697 0.493120 0.282321 0.136358 -0.411772 -0.410211 -0.380482 -0.394786 -0.227810 -0.228351 -0.252215 -0.210330 -0.243644 0.196856 0.224922 0.196541 0.227779 0.229040 0.229461 0.249390 0.234192 0.229979 0.281571 0.214495 0.223427 0.223034 0.225088 0.225176 0.226678 0.355105
chargesum: 0.00000
title: Mulliken charges with hydrogens summed into heavy atoms:
elementType: O N C C C C C C C C C C C C C C C
charge: -0.092456 -0.055618 0.056875 -0.148444 0.003804 0.493120 0.282321 0.136358 -0.177580 -0.180233 -0.098911 -0.180291 -0.004383 -0.005317 -0.027127 0.014846 -0.016965
polarizability: 2.36911448e+02 -1.58878600e+01 1.51229864e+02 -1.15225570e+01 -7.11697064e+00 1.16313735e+02
1716.lowfreq: -10.2940 -5.7404 -0.0005 -0.0005 -0.0004 4.0115 12.7350 18.2645 36.4227
frequency: 12.3340 16.9068 36.3658 41.4108 85.1567 112.7544 132.1095 172.8386 187.8572 221.2379 262.8271 335.1963 339.5807 363.4925 370.2993 403.3737 438.8982 484.6758 500.3415 527.4416 541.1269 583.5464 603.6915 617.3709 693.8300 705.3479 715.6777 756.3003 757.6041 774.9534 800.2796 814.0857 827.5498 844.5971 853.4536 916.9695 934.1956 965.2182 975.0034 989.3300 990.4218 992.8411 1004.6895 1025.2204 1032.9317 1036.1841 1068.6525 1074.0778 1100.4746 1140.2341 1148.2150 1164.6944 1167.4991 1171.3784 1185.8801 1202.4526 1215.0707 1234.7382 1241.9974 1271.8802 1277.4315 1297.7221 1325.9866 1339.5856 1377.7663 1382.2009 1401.0939 1437.5166 1438.9323 1450.6713 1472.6004 1479.4952 1483.9253 1492.5323 1496.2663 1592.8072 1602.3583 1614.4349 1616.8517 2864.4669 2905.3599 2977.9898 2979.2900 3005.6987 3051.2731 3108.5786 3113.4443 3115.4244 3130.7972 3133.3599 3142.2661 3148.9976 3161.1678 3165.1614 3418.5569 3581.0614
redmass: 3.9679 4.4529 3.7556 3.9212 4.3276 2.5163 2.3105 4.0319 5.1380 4.5414 3.3720 3.7114 2.5696 1.1506 4.2894 2.8185 2.9747 4.1040 3.7651 5.0694 3.6567 5.3995 4.9092 6.3561 1.5284 1.7472 1.9912 1.7594 1.7594 3.7105 1.1700 3.5877 4.9363 1.3333 1.2462 1.4492 1.3803 1.6010 1.3877 1.9141 3.3427 1.3194 1.9047 2.2967 2.6380 2.1007 2.2911 2.2330 1.5748 3.8986 1.2576 1.1416 1.0723 1.0517 1.1118 2.0355 2.2685 1.3557 2.6073 1.3719 1.2049 1.4582 1.2561 1.3878 1.7781 7.8383 3.5433 2.3134 2.1435 1.2260 1.1257 1.1769 2.1444 2.0519 1.1725 6.0573 6.5316 6.1892 6.7346 1.0708 1.0684 1.0642 1.0892 1.0854 1.1003 1.0884 1.0867 1.0869 1.0909 1.0874 1.0959 1.0931 1.1015 1.1001 1.0740 1.0659
irintensity: 0.1003 0.0592 0.2067 0.2436 0.3638 3.5098 2.8298 2.8014 0.3934 3.5634 12.1649 2.0266 0.5998 127.4555 3.1520 0.0017 7.0493 14.4104 7.9902 17.0065 2.7072 2.3646 3.1080 0.0829 46.7271 47.5179 38.3075 32.5409 83.2586 32.6341 0.4377 2.7122 17.6254 0.4881 0.0183 3.3325 3.9511 8.2370 0.0265 2.5226 0.6802 0.3841 5.8739 6.7253 0.2100 14.7519 69.4018 29.2374 9.6777 98.4576 62.9406 5.1923 2.7871 0.2567 0.1457 26.0094 1.0792 5.6676 35.1039 22.4966 16.2397 18.3984 0.2953 18.2025 1.9514 0.2098 7.6750 32.3202 8.1679 49.8676 28.2618 0.7442 17.6719 29.5658 3.1948 1.3490 25.5173 9.7808 2.3531 97.0424 47.2276 27.4646 18.6835 31.4256 27.2103 15.6198 10.1214 6.3732 12.2540 7.7342 47.3882 13.1311 25.5180 26.4912 0.8672 25.0764
temp: 298.150 k
press: 1.00000 atm
elementType: 8 7 6 6 6 6 6 6 6 6 6 6 6 6 6 6 6 1 1 1 1 1 1 1 1 1 1 1 1 1 1 1 1 1
symmnumber: 1
zpe: 740296.1 jmol-1
zpe.correction: 0.281964 hartree
zpe.thermalcorrener: 0.297801 hartree
zpe.thermalcorrenthalpy: 0.298745 hartree
zpe.thermalcorrgfe: 0.235004 hartree
zpe.sumelectzpe: -710.520608 hartree
zpe.sumelectthermal: -710.504771 hartree
zpe.sumelectthermalent: -710.503827 hartree
zpe.sumelectthermalfe: -710.567568 hartree
dipole: 1.3411 1.0934 -0.6038
dipole: 1.8327
quadrupole: -83.1538 -97.2305 -99.8555
quadrupole: 4.1813 -1.9901 -2.0453
quadrupole: 10.2595 -3.8173 -6.4422 4.1813 -1.9901 -2.0453
hfenergy: -710.8025716 hartree
pointgroup: C01 [X(C15H17N1O1)]
dipole: -0.5090063 -0.5106246 0.0088509 debye
polarizability: 238.0157037|-5.2535335|148.6047804|16.0357849|-10.2163642|117.8345633 unknown
InChI: InChI=1S/C15H17NO/c17-15-9-5-4-8-14(15)12-16-11-10-13-6-2-1-3-7-13/h1-9,16-17H,10-12H2
charge 0 multiplicity 1
34 atoms
O  -3.707525 -1.994513 1.564316
N  -0.484766 0.042143 -0.283569
C  0.916136 -0.158966 0.139207
C  1.892122 0.481969 -0.880175
C  -1.489533 -0.51304 0.650601
C  3.343418 0.338497 -0.448368
C  -2.910381 -0.132428 0.256293
C  -4.010916 -0.896367 0.728567
C  3.95413 1.323418 0.370788
C  4.105595 -0.80112 -0.813975
C  -3.187642 0.981675 -0.569674
C  -5.341463 -0.565681 0.383048
C  5.287855 1.175327 0.813686
C  5.440039 -0.954654 -0.374125
C  -4.512896 1.327944 -0.923326
C  -5.591631 0.55033 -0.446617
C  6.036228 0.033853 0.442885
H  1.186902 -1.236561 0.273508
H  1.052313 0.325218 1.12621
H  1.739622 0.002033 -1.868183
H  1.615266 1.546801 -0.989054
H  -1.269391 -0.104838 1.658802
H  -1.429898 -1.621169 0.758482
H  -0.641678 -0.301272 -1.242778
H  3.380401 2.21377 0.657848
H  3.651402 -1.569727 -1.452372
H  -2.336223 1.572811 -0.922412
H  -6.176093 -1.172502 0.759681
H  5.743938 1.949215 1.441825
H  6.014581 -1.840038 -0.670036
H  -4.700432 2.196665 -1.563323
H  -6.622694 0.806369 -0.714138
H  7.071703 -0.081656 0.782552
H  -4.533987 -2.474107 1.820327
