program: Gaussian 09
title: 000278483
version: EM64L-G09RevD.01
frameworkgroup: C1[X(C13H20N2O2)]
method: RPBEPBE
basis: SDD
operation: Freq
keyword: #p
keyword: freq=noraman
keyword: PBEPBE/SDD
title: #p freq=noraman PBEPBE/SDD
converged: YES YES NO NO
title: Mulliken charges:
elementType: O O N N C C C C C C C C C C C C C H H H H H H H H H H H H H H H H H H H H
charge: -0.346034 -0.264664 -0.164800 -0.375357 -0.229321 0.512338 -0.562276 0.413293 0.144751 -0.710286 -0.704930 -0.374947 -0.372106 -0.644621 -0.649207 0.270716 -0.604681 0.224895 0.237687 0.202764 0.211131 0.226487 0.270593 0.201842 0.200870 0.238477 0.237196 0.231707 0.214309 0.230013 0.230287 0.215686 0.232789 0.329371 0.226947 0.271403 0.227678
chargesum: 0.00000
title: Mulliken charges with hydrogens summed into heavy atoms:
elementType: O O N N C C C C C C C C C C C C C
charge: -0.346034 -0.264664 -0.164800 -0.045986 -0.004426 0.512338 -0.324589 0.413293 0.144751 -0.069904 -0.031625 -0.136470 -0.134909 0.031408 0.029555 0.270716 0.121346
polarizability: 2.33206993e+02 -4.07648865e+00 1.59708718e+02 9.69036465e+00 5.79986028e+00 1.12482365e+02
1716.lowfreq: -9.5360 -2.9124 -0.0006 -0.0005 -0.0002 1.9732 33.4391 40.7242 44.2615
frequency: 33.4027 40.6662 44.2364 63.1106 69.1354 92.8774 114.4592 118.5432 133.0894 140.0891 152.6343 208.5777 218.7670 227.6278 232.0244 243.7850 255.8820 268.8040 312.8577 326.7016 376.7588 386.3789 416.4114 455.1183 474.2086 533.2961 549.7760 563.7677 579.1325 627.7520 650.9062 683.8902 690.8976 738.4640 762.7190 801.5964 835.1762 859.3771 879.2348 902.4913 924.5668 932.6788 956.3206 962.7335 1056.4939 1060.0466 1074.7201 1094.3178 1110.8924 1112.7432 1115.9812 1127.2677 1145.4655 1147.4299 1164.4985 1177.5087 1203.0995 1226.2230 1268.2527 1279.4765 1307.1281 1331.5824 1361.2622 1375.4277 1386.3103 1394.9807 1427.0857 1430.4397 1438.1700 1456.8979 1461.4772 1462.8703 1466.4164 1470.6994 1473.7196 1479.3714 1484.1626 1491.7691 1495.9897 1502.0669 1510.7415 1519.0404 1580.1301 1627.0187 1690.3284 2929.6258 2938.9089 2972.6264 2975.2180 2976.6985 2992.1641 2995.2814 3009.5125 3052.9904 3062.1316 3071.3491 3077.6820 3089.7640 3094.2848 3100.7412 3110.5592 3146.1018 3154.0691 3173.3019 3575.1789
redmass: 4.0292 3.4467 4.3836 2.6669 3.3907 2.6814 1.1459 2.6433 2.0364 3.0774 2.9367 1.1961 1.5697 1.2425 3.1305 2.1742 1.5749 2.5133 4.0295 3.3200 3.9056 4.0290 3.1561 3.2425 3.0030 4.3067 3.8584 3.2205 1.1137 4.0138 4.3976 5.6130 11.2165 3.1531 3.9049 1.6524 4.1349 1.7615 4.0256 2.9491 1.2066 1.3620 1.4633 2.3271 1.4892 3.2008 2.6497 2.1729 1.3171 1.2427 2.5557 1.2810 1.6230 1.5216 2.2160 1.7636 1.7430 2.4241 2.8584 1.7978 1.3524 1.5453 3.3994 1.1987 3.2756 1.3428 1.5918 1.1615 1.6887 1.3816 1.2735 1.0417 1.0605 1.0532 1.0472 1.0522 1.0445 1.0824 1.1692 1.6268 1.1449 1.6469 7.3719 6.1875 9.2833 1.0369 1.0397 1.0351 1.0354 1.0355 1.0992 1.1025 1.0838 1.1026 1.0998 1.0986 1.1000 1.0956 1.0997 1.0935 1.0979 1.0882 1.0891 1.0952 1.0771
irintensity: 0.2904 4.1238 5.6442 1.7097 3.3134 2.3751 0.0407 0.6476 1.9048 1.3286 2.2082 0.1918 1.8357 0.8864 1.8507 0.6958 0.7397 1.3769 16.3161 0.1337 4.5218 2.1748 3.6550 2.4615 9.6505 2.4319 1.0140 2.6208 123.8706 1.5396 2.3414 1.5720 22.2451 4.4510 6.1309 39.7136 5.0394 22.8564 54.8348 13.7862 2.4061 2.7229 1.6682 24.8723 26.3418 9.8826 186.1552 128.8685 0.9941 0.0265 4.7292 0.0650 84.2064 3.1938 92.2012 273.0444 28.3607 3.1573 34.5406 2.0837 3.7340 9.8094 55.2548 19.1299 6.4401 24.6947 19.5498 28.2886 20.1333 191.3598 34.5401 0.3779 10.7495 0.7868 18.4467 7.3068 13.0964 3.0806 26.3105 121.1130 254.2061 5.6451 18.3865 189.4664 249.8116 121.0397 84.7285 24.1485 57.6425 86.9743 10.4906 89.4302 6.3804 37.1954 3.8055 109.0190 32.5492 4.5871 14.9321 50.5053 4.1599 11.7212 14.2079 15.0613 38.5817
temp: 298.150 k
press: 1.00000 atm
elementType: 8 8 7 7 6 6 6 6 6 6 6 6 6 6 6 6 6 1 1 1 1 1 1 1 1 1 1 1 1 1 1 1 1 1 1 1 1
symmnumber: 1
zpe: 815426.2 jmol-1
zpe.correction: 0.310579 hartree
zpe.thermalcorrener: 0.329946 hartree
zpe.thermalcorrenthalpy: 0.330890 hartree
zpe.thermalcorrgfe: 0.262102 hartree
zpe.sumelectzpe: -766.029207 hartree
zpe.sumelectthermal: -766.009841 hartree
zpe.sumelectthermalent: -766.008897 hartree
zpe.sumelectthermalfe: -766.077685 hartree
dipole: 0.9044 -0.2626 -1.4338
dipole: 1.7154
quadrupole: -67.0118 -96.4861 -109.7469
quadrupole: 1.3342 8.4169 1.9470
quadrupole: 24.0698 -5.4045 -18.6653 1.3342 8.4169 1.9470
hfenergy: -766.3397868 hartree
pointgroup: C01 [X(C13H20N2O2)]
dipole: -0.3492603 0.0905098 -0.5703682 debye
polarizability: 233.1558577|-5.8332629|159.4486611|-8.6686036|-7.3047209|112.7935566 unknown
InChI: InChI=1S/C13H20N2O2/c1-9(2)11-8-10(15(4)5)6-7-12(11)17-13(16)14-3/h6-9,14H,1-5H3
charge 0 multiplicity 1
37 atoms
O  1.880941 0.612527 -0.823745
O  2.541286 0.424451 1.456991
N  -3.695501 0.49454 0.240521
N  4.080499 0.719026 -0.299736
C  0.642852 -2.007765 -0.140036
C  -0.14431 -0.695264 -0.206211
C  -1.537498 -0.682085 0.037141
C  -2.315209 0.515518 -0.0060
C  0.482138 0.541242 -0.494362
C  0.05198 -3.090105 -1.080952
C  0.73253 -2.522845 1.322515
C  -1.638886 1.739736 -0.31092
C  -0.253617 1.739701 -0.54814
C  -4.466281 1.741014 0.192999
C  -4.36423 -0.768386 0.566723
C  2.824875 0.573573 0.2449
C  5.291852 0.714599 0.521989
H  1.672659 -1.799141 -0.485779
H  -2.025229 -1.634006 0.266596
H  -0.966623 -3.386072 -0.767675
H  0.683186 -3.998265 -1.062114
H  -0.005553 -2.727751 -2.123321
H  1.193983 -1.758208 1.970466
H  1.341515 -3.445393 1.371859
H  -0.273359 -2.75623 1.719635
H  -2.185088 2.685243 -0.35899
H  0.269263 2.67357 -0.779474
H  -4.11225 2.477613 0.944252
H  -5.5256 1.525516 0.40496
H  -4.411715 2.222635 -0.805419
H  -4.267525 -1.511749 -0.252054
H  -5.438289 -0.584359 0.728796
H  -3.955096 -1.227811 1.490809
H  4.137166 0.840983 -1.310995
H  5.968999 -0.112899 0.238942
H  4.987223 0.576964 1.571696
H  5.840511 1.671083 0.43643
