program: Gaussian 09
title: 000278472
version: EM64L-G09RevD.01
frameworkgroup: C1[X(C15H15NO)]
method: RPBEPBE
basis: SDD
operation: Freq
keyword: #p
keyword: freq=noraman
keyword: PBEPBE/SDD
title: #p freq=noraman PBEPBE/SDD
converged: YES YES NO NO
title: Mulliken charges:
elementType: O N C C C C C C C C C C C C C C C H H H H H H H H H H H H H H H
charge: -0.472976 -0.680990 0.103263 0.224617 0.062893 0.284758 0.269234 -0.814010 -0.367756 -0.405566 -0.432171 -0.413168 -0.293171 -0.213996 -0.231499 -0.222220 -0.245688 0.224388 0.231565 0.261379 0.246687 0.234226 0.285275 0.211429 0.225606 0.220904 0.226195 0.229235 0.231386 0.357186 0.292510 0.370475
chargesum: 0.00000
title: Mulliken charges with hydrogens summed into heavy atoms:
elementType: O N C C C C C C C C C C C C C C C
charge: -0.102501 -0.031293 0.103263 0.224617 0.062893 0.284758 0.269234 -0.096677 -0.121069 -0.171340 -0.146896 -0.201740 -0.067566 0.006908 -0.005304 0.007015 -0.014302
polarizability: 2.98252396e+02 -4.50144030e+00 1.47078688e+02 2.93990091e+00 -3.76215863e+00 1.22180531e+02
1716.lowfreq: -10.8789 -6.0817 -0.0008 -0.0008 -0.0002 6.2462 37.6754 52.8466 63.5296
frequency: 37.4815 52.8298 63.5045 78.5598 127.3649 165.1067 188.0415 210.6910 238.3272 255.1133 311.7297 330.8533 368.8820 394.3304 402.6885 420.6488 452.9983 469.4157 502.0725 519.9572 543.4210 553.3861 584.5583 597.4008 613.4751 620.1356 654.1920 675.7095 708.4679 749.6747 754.0198 761.7352 775.3688 841.2768 848.5675 860.6285 927.6614 943.2725 967.6437 974.2548 983.1910 986.7183 997.2309 1022.5470 1026.3224 1036.5747 1052.3611 1067.8661 1080.4671 1091.5160 1142.3174 1172.4396 1173.1548 1189.6064 1198.7922 1276.9183 1287.3619 1301.4283 1324.7241 1341.5549 1367.1156 1389.9173 1399.1593 1432.6117 1456.4602 1469.2185 1470.4454 1480.4065 1493.2981 1571.6913 1574.5163 1602.1496 1612.0707 1623.2788 1627.5059 2966.1627 3036.3049 3100.7129 3114.1798 3120.6229 3125.5527 3133.3741 3138.8889 3143.1839 3147.3094 3164.2449 3166.0183 3478.0520 3497.1917 3665.5286
redmass: 4.4085 4.0952 4.2627 4.1093 4.6163 2.1554 2.2145 3.1280 3.0825 4.0310 3.4673 3.1284 5.0681 3.8405 2.7854 1.1631 3.5397 3.6670 3.3104 1.3562 2.8433 4.3313 4.4453 2.8136 3.2618 1.7300 4.9547 5.6897 1.8794 2.8501 1.6882 2.1721 2.4491 4.1761 1.5307 1.2536 1.3740 1.3526 1.3828 2.4069 1.8486 2.8288 1.3029 2.5368 1.8811 1.4390 1.8975 2.8510 1.9718 1.9958 1.3868 1.0598 1.0533 1.1963 1.5253 2.3023 2.4252 1.7187 1.7971 1.8927 5.3930 7.4229 1.2031 2.3304 2.9614 1.0690 1.2244 1.8358 2.6613 5.3348 5.5007 5.1271 2.3699 4.4999 2.2055 1.0399 1.0954 1.0966 1.0865 1.0853 1.0868 1.0878 1.0919 1.0938 1.0960 1.1015 1.1002 1.0643 1.0478 1.1008
irintensity: 0.7530 0.1458 1.2136 0.1444 1.5594 0.8453 2.0574 3.5613 3.8420 1.3923 13.9137 1.9807 3.3437 10.9033 1.3082 121.1016 3.6817 8.5828 3.8229 33.5306 20.3583 3.8451 8.4545 42.6118 32.6213 116.0244 20.4992 4.7199 36.0305 15.0995 73.3564 25.9921 31.4905 4.2579 1.5678 1.5339 1.4083 4.6380 7.8321 49.6095 2.1623 0.1640 1.1172 12.0264 12.2360 1.7696 20.1551 28.8202 28.2590 23.9612 18.7562 9.2420 0.0420 14.5910 45.7818 4.2116 6.2419 15.3985 26.9840 29.1674 2.0376 25.7690 10.8250 10.7522 36.5140 9.8773 11.5377 25.8927 58.0596 0.5581 12.0070 114.3629 65.8810 49.3782 238.8124 38.3920 21.4797 15.0024 14.3610 6.4231 0.8888 5.1327 9.1269 37.1622 37.2835 31.6017 24.6624 53.8623 74.1044 56.6299
temp: 298.150 k
press: 1.00000 atm
elementType: 8 7 6 6 6 6 6 6 6 6 6 6 6 6 6 6 6 1 1 1 1 1 1 1 1 1 1 1 1 1 1 1
symmnumber: 1
zpe: 681068.2 jmol-1
zpe.correction: 0.259405 hartree
zpe.thermalcorrener: 0.274564 hartree
zpe.thermalcorrenthalpy: 0.275508 hartree
zpe.thermalcorrgfe: 0.216987 hartree
zpe.sumelectzpe: -709.361703 hartree
zpe.sumelectthermal: -709.346544 hartree
zpe.sumelectthermalent: -709.345600 hartree
zpe.sumelectthermalfe: -709.404121 hartree
dipole: -1.4262 0.9332 -0.8445
dipole: 1.9022
quadrupole: -87.1408 -93.4558 -99.6471
quadrupole: 0.9467 -1.8658 -2.2797
quadrupole: 6.2737 -0.0412 -6.2325 0.9467 -1.8658 -2.2797
hfenergy: -709.621108 hartree
pointgroup: C01 [X(C15H15N1O1)]
dipole: -0.5690372 0.4743753 0.1059286 debye
polarizability: 298.3721895|-3.2432385|133.4398754|0.9720297|12.8719708|135.699549 unknown
InChI: InChI=1S/C15H15NO/c1-11(12-7-3-2-4-8-12)15(17)13-9-5-6-10-14(13)16/h2-10,17H,16H2,1H3
charge 0 multiplicity 1
32 atoms
O  -0.048204 0.579236 1.523959
N  2.26089 2.042657 1.325973
C  -0.634882 -0.144051 -0.735849
C  1.793779 -0.047586 0.093046
C  0.325554 0.100031 0.227613
C  -2.08835 -0.081038 -0.382263
C  2.712152 0.924955 0.631825
C  -0.288872 -0.428687 -2.188818
C  2.325704 -1.180674 -0.580923
C  -3.01573 0.661394 -1.168758
C  -2.59909 -0.793695 0.746367
C  4.111252 0.743842 0.412656
C  3.708878 -1.355665 -0.780359
C  4.601858 -0.372344 -0.286579
C  -4.386321 0.704412 -0.835805
C  -3.971521 -0.751056 1.078694
C  -4.873379 0.001435 0.291722
H  -0.921039 0.178731 -2.863277
H  -0.47386 -1.487924 -2.456583
H  0.764471 -0.197363 -2.411795
H  1.627791 -1.946594 -0.935791
H  -2.65628 1.22361 -2.037967
H  -1.920339 -1.425564 1.331949
H  4.808747 1.49252 0.809402
H  4.085525 -2.242889 -1.298881
H  5.682332 -0.485588 -0.433074
H  -5.075913 1.289343 -1.455216
H  -4.336959 -1.3169 1.943408
H  -5.938383 0.03318 0.546412
H  1.306894 2.026132 1.689357
H  2.934918 2.699796 1.709726
H  -1.034127 0.707443 1.556928
