program: Gaussian 09
title: 000278524
version: EM64L-G09RevD.01
frameworkgroup: C1[X(C14H14Br4O4)]
method: RPBEPBE
basis: SDD
operation: Freq
keyword: #p
keyword: freq=noraman
keyword: PBEPBE/SDD
title: #p freq=noraman PBEPBE/SDD
converged: YES YES NO NO
title: Mulliken charges:
elementType: Br Br Br Br O O O O C C C C C C C C C C C C C C H H H H H H H H H H H H H H
charge: 0.064109 0.059823 0.113332 -0.011693 -0.236173 -0.246033 -0.186489 -0.187345 -0.421047 -0.419280 -0.447032 -0.645952 0.586692 0.335367 0.333346 -0.388051 -0.302550 -0.226165 -0.238841 -0.232601 -0.493584 -0.490578 0.369138 0.325115 0.336154 0.231693 0.229554 0.232685 0.232388 0.234206 0.238863 0.253636 0.253667 0.241806 0.252264 0.249577
chargesum: 0.00000
title: Mulliken charges with hydrogens summed into heavy atoms:
elementType: Br Br Br Br O O O O C C C C C C C C C C C C C C
charge: 0.064109 0.059823 0.113332 -0.011693 -0.236173 -0.246033 -0.186489 -0.187345 -0.051909 -0.094166 -0.447032 -0.309799 0.586692 0.335367 0.333346 -0.156358 -0.072996 0.006520 -0.006453 0.001605 0.252581 0.253069
polarizability: 2.53809372e+02 1.81897364e+01 2.24079113e+02 1.21989630e+01 -4.14827732e+00 2.21464143e+02
1716.lowfreq: -7.7088 -5.4169 -0.0006 -0.0003 0.0002 4.7426 19.1026 25.3502 32.2987
frequency: 19.0437 25.2355 32.2422 42.3398 55.9648 58.4902 67.4750 73.3327 73.7599 84.6873 89.0992 98.0420 106.7681 109.4147 117.0367 145.7386 152.0589 155.4871 172.9484 181.4755 196.1804 204.8251 229.8110 240.3242 251.2737 277.7632 330.5144 372.4599 400.9653 407.2220 455.3822 487.3151 508.8756 556.0983 586.8590 599.4369 615.3282 633.3790 664.3479 696.9918 700.1825 733.2384 759.8356 778.9039 788.4237 830.7387 847.2364 870.0174 925.5149 934.3040 975.9134 978.0097 990.4994 1000.1568 1023.2284 1025.6357 1053.0158 1083.5900 1091.8374 1108.8478 1114.2917 1130.2581 1150.3313 1152.1141 1153.8047 1170.7492 1176.0808 1178.5266 1193.0996 1211.6805 1219.1975 1257.8521 1307.0096 1322.7421 1364.9310 1390.5445 1416.4172 1420.5329 1446.2397 1452.6249 1453.2930 1457.5941 1460.4904 1484.6692 1593.4969 1610.9441 1638.5847 1655.0356 3008.0074 3010.0493 3065.7072 3076.1726 3096.4347 3113.6190 3115.5107 3125.0857 3127.1887 3139.7183 3152.9044 3159.5260 3160.7345 3168.8538
redmass: 10.0315 10.5604 4.7892 5.8245 4.7590 6.6337 5.0240 2.7661 5.8268 3.6354 2.2432 3.4257 13.4345 1.6754 4.4320 8.2240 6.5304 10.0219 26.7622 8.3810 5.6807 6.7818 5.3167 10.2220 5.3652 5.7253 5.7302 8.5092 2.8170 5.0700 4.9915 6.5874 6.7598 6.4455 4.9842 5.8388 6.5278 6.6097 6.5407 1.7934 4.6688 6.7666 6.2497 1.9610 7.2790 4.7995 1.2637 8.0985 1.4527 8.8333 7.4355 1.4017 6.1060 1.3382 5.2263 2.4438 3.8051 2.0649 1.6506 1.2711 1.2646 1.2978 1.4745 1.5571 1.7762 1.6627 1.5917 1.9994 1.1286 1.7091 1.8459 1.4681 1.3480 1.3731 1.5386 4.8430 1.1756 1.1761 2.1482 1.0502 1.0496 1.0505 1.0506 2.2831 5.9644 6.0180 10.6135 10.8446 1.0293 1.0293 1.0830 1.0847 1.0865 1.1049 1.1052 1.0870 1.0874 1.0913 1.0961 1.1051 1.1052 1.1016
irintensity: 0.3289 0.2483 0.0588 0.2151 2.1459 0.2348 0.7597 0.6519 4.0748 0.6661 0.1007 0.4122 0.3535 0.0469 0.3007 1.4135 1.9342 0.2136 1.4481 0.4611 6.3053 1.0057 2.8331 1.0102 5.8703 15.7593 11.9021 6.1434 0.4325 15.8917 5.7756 61.2437 22.6299 52.0079 58.8421 22.6531 2.6780 15.8812 4.9430 44.0712 23.3592 6.9621 24.9501 24.4550 7.6593 3.0119 0.2423 17.9202 0.2937 19.1617 12.6360 0.3278 0.5451 0.4613 79.2617 5.6407 1.9221 23.4834 11.5905 0.2975 0.3495 12.1071 12.2420 24.9866 140.9340 98.8533 93.3286 76.4094 5.4693 16.3538 32.1443 28.9042 48.4942 3.7984 6.2772 0.8734 19.9631 18.1630 11.9923 12.6067 15.1109 8.9969 10.4292 3.0409 1.0876 2.3285 193.2513 113.7332 27.1955 26.1509 13.8009 1.5666 0.1200 19.1641 15.7888 5.1299 4.1692 10.7855 29.0907 9.8067 9.4158 21.8685
temp: 298.150 k
press: 1.00000 atm
elementType: 35 35 35 35 8 8 8 8 6 6 6 6 6 6 6 6 6 6 6 6 6 6 1 1 1 1 1 1 1 1 1 1 1 1 1 1
symmnumber: 1
zpe: 659009.4 jmol-1
zpe.correction: 0.251003 hartree
zpe.thermalcorrener: 0.276453 hartree
zpe.thermalcorrenthalpy: 0.277397 hartree
zpe.thermalcorrgfe: 0.190046 hartree
zpe.sumelectzpe: -894.960449 hartree
zpe.sumelectthermal: -894.935000 hartree
zpe.sumelectthermalent: -894.934055 hartree
zpe.sumelectthermalfe: -895.021406 hartree
dipole: 1.1839 -0.2280 -1.9378
dipole: 2.2823
quadrupole: -148.5972 -157.4393 -163.9459
quadrupole: 11.1634 9.4294 -4.5412
quadrupole: 8.0636 -0.7785 -7.2851 11.1634 9.4294 -4.5412
hfenergy: -895.2114524 hartree
pointgroup: C01 [X(C14H14Br4O4)]
dipole: 0.438322 -0.2801769 -0.7318551 debye
polarizability: 255.5687667|19.2302686|220.6589791|6.7084163|-5.0342261|223.1248817 unknown
InChI: InChI=1S/C14H14Br4O4/c1-21-12(19)14(18,13(20)22-2)11(17)10(16)9(15)8-6-4-3-5-7-8/h3-7,9-11H,1-2H3
charge 0 multiplicity 1
36 atoms
Br -1.196521 -0.623348 -2.246545
Br 0.833126 1.860267 -0.666839
Br -1.713328 -0.390655 2.519089
Br 1.52167 -2.813681 0.280973
O  -2.709979 1.860461 -0.850402
O  -3.164949 -2.050368 0.038693
O  -2.069713 2.410456 1.31761
O  -4.507124 -0.163191 0.293239
C  -0.844924 -0.583876 -0.23691
C  0.556397 -0.030416 0.071555
C  -2.047412 0.032274 0.530304
C  1.728701 -0.862814 -0.479272
C  3.118281 -0.393623 -0.137806
C  -2.256697 1.570997 0.419289
C  -3.384102 -0.702621 0.258283
C  4.109633 -0.403044 -1.151478
C  3.46916 0.039381 1.167709
C  5.425374 0.025437 -0.872855
C  4.782737 0.465973 1.446922
C  5.765448 0.462092 0.427705
C  -2.943866 3.2986 -1.133251
C  -4.380609 -2.872823 -0.185319
H  -0.842233 -1.662006 -0.004338
H  0.645315 0.11501 1.160605
H  1.60312 -1.035579 -1.559039
H  3.846234 -0.740714 -2.161195
H  2.723896 0.032109 1.971659
H  6.180571 0.018856 -1.666099
H  5.043358 0.79985 2.457022
H  6.786006 0.794139 0.647554
H  -3.319361 3.319167 -2.164845
H  -1.994448 3.851982 -1.038567
H  -3.685169 3.703216 -0.424954
H  -4.001693 -3.893444 -0.328158
H  -4.913285 -2.512975 -1.080914
H  -5.044013 -2.807987 0.692975
