program: Gaussian 09
title: 000278449
version: EM64L-G09RevD.01
frameworkgroup: C1[X(C6H7NO2)]
method: RPBEPBE
basis: SDD
operation: Freq
keyword: #pfreq=noraman
keyword: PBEPBE/SDD
title: #p freq=noraman PBEPBE/SDD
converged: YES YES NO NO
title: Mulliken charges:
elementType: O O N C C C C C C H H H H H H H
charge: -0.202260 -0.175937 0.006848 -0.480006 -0.038666 -0.268395 0.200192 -0.674552 -0.153165 0.259020 0.254045 0.250790 0.304309 0.250679 0.220901 0.246197
chargesum: 0.00000
title: Mulliken charges with hydrogens summed into heavy atoms:
elementType: O O N C C C C C C
charge: -0.202260 -0.175937 0.006848 0.033059 0.212125 0.035914 0.200192 0.043225 -0.153165
polarizability: 7.74300601e+01 -1.05793790e+00 7.23078476e+01 4.51405709e+00 2.35805813e+00 5.84728676e+01
1716.lowfreq: -12.8328 -0.0011 -0.0011 -0.0009 4.1027 15.7689 75.4796 106.3231 141.4828
frequency: 75.4743 106.3175 141.4813 218.2825 235.3232 327.7718 400.0578 408.7062 446.0989 512.8771 628.5593 643.3661 709.2005 774.6516 833.9030 848.3563 906.3374 949.4480 1024.0887 1038.3801 1074.8242 1110.4406 1126.6708 1178.7601 1224.9094 1271.6047 1303.1686 1321.5855 1342.1374 1399.3277 1463.3673 1471.4429 1478.5363 1709.1996 2195.4917 2994.1027 3034.7954 3051.4692 3066.9470 3093.4801 3105.7640 3112.8678
redmass: 5.4941 4.4253 8.1994 3.8849 1.0677 2.5377 3.5514 5.0926 6.9206 5.8716 6.4880 9.1744 3.9386 3.1418 3.0078 4.8478 2.4160 2.3034 2.2972 2.0515 3.4307 1.5877 2.0334 1.3843 1.3239 1.5025 1.4460 1.3512 1.3896 1.2199 1.0586 1.0746 1.0494 12.8362 12.5277 1.0365 1.0649 1.0823 1.0892 1.0982 1.1010 1.1037
irintensity: 2.5023 1.7719 4.3115 2.5713 0.0954 1.4346 2.1029 1.2970 3.1898 5.3063 9.6744 3.4758 4.6207 2.8904 13.3359 24.2750 25.1285 27.0511 16.1053 52.6714 187.0340 15.8865 18.4110 3.9995 3.3697 13.3186 13.3422 1.7427 5.4068 24.5929 13.5610 8.8558 7.4344 341.9627 11.2068 9.5630 12.7132 0.8205 10.9107 28.7619 15.8385 14.6917
temp: 298.150 k
press: 1.00000 atm
elementType: 8 8 7 6 6 6 6 6 6 1 1 1 1 1 1 1
symmnumber: 1
zpe: 319161.1 jmol-1
zpe.correction: 0.121562 hartree
zpe.thermalcorrener: 0.130029 hartree
zpe.thermalcorrenthalpy: 0.130973 hartree
zpe.thermalcorrgfe: 0.088085 hartree
zpe.sumelectzpe: -437.345047 hartree
zpe.sumelectthermal: -437.336580 hartree
zpe.sumelectthermalent: -437.335636 hartree
zpe.sumelectthermalfe: -437.378524 hartree
dipole: 3.9688 -2.0437 3.8770
dipole: 5.9126
quadrupole: -55.7759 -64.1393 -49.5465
quadrupole: -5.1878 -3.5963 1.0809
quadrupole: 0.7113 -7.6521 6.9408 -5.1878 -3.5963 1.0809
hfenergy: -437.4666088 hartree
pointgroup: C01 [X(C6H7N1O2)]
dipole: 1.1366026 1.6643497 -1.161573 debye
dipolederiv: -1.2273497 -0.5048321 -0.0398205 -0.1740706 -0.7032178 -0.1060436 -0.0469331 -0.0330609 -0.309988 -0.682051 -0.2792065 -0.0494614 -0.3203773 -1.0257094 -0.1227143 -0.0213853 -0.0151993 -0.2895069 -0.2507437 0.0168349 -0.0020955 0.0205646 -0.2052725 -0.0121156 0.0726673 -0.0436101 -0.2229762 -0.0502439 0.0843883 -0.0562981 -0.0000865 -0.0147826 -0.0301008 -0.0416748 -0.0211196 0.0604867 0.4695884 0.0800575 0.04168 0.3077455 0.600771 0.0978263 0.1043976 0.0623569 0.3963148 -0.003279 0.1428967 0.089502 0.1723882 -0.1826709 -0.057588 0.1063527 -0.0499787 0.0921482 1.6400792 0.5586467 0.0348464 0.1262463 1.447035 0.2180583 0.0262471 0.0330846 0.1500085 -0.0174088 -0.0060202 -0.0577432 -0.0426223 -0.0254251 -0.0211673 -0.0893156 -0.0474523 -0.1435127 0.0066188 -0.0633502 -0.0659723 -0.0264099 -0.0879966 0.0588004 -0.1922836 0.1425471 0.1586539 0.0249279 0.001679 0.0025425 -0.0088546 0.0943538 0.0104213 -0.0103095 0.047251 -0.127472 0.1014242 -0.0017218 0.0016212 -0.0057295 -0.0688302 -0.0466345 0.0073591 -0.0885091 0.078391 -0.0589214 -0.030905 0.0787695 -0.0307329 0.0284682 -0.015245 0.082668 0.0116918 -0.0346844 0.0129358 -0.0025394 -0.0224256 -0.0109693 0.1178679 -0.0138815 -0.0116309 -0.0130407 0.0365468 -0.0134621 0.0942054 -0.0548657 0.1205116 0.0334233 0.0407546 -0.040013 0.0163684 0.0684636 0.0691598 -0.074388 -0.0093173 -0.1107452 -0.1069353 -0.008674 -0.0205593 0.0041309 0.0783795 -0.0212745 -0.0157454 0.1090378 -0.0168582 0.0989212 0.0083037 0.0744131 -0.0054602 0.0087473 unknown
polarizability: 74.1708136|5.7739066|67.7709293|-6.3825978|5.6162191|66.2690323 unknown
InChI: InChI=1S/C6H7NO2/c1-4-2-5(3-7)6(8)9-4/h4-5H,2H2,1H3
charge 0 multiplicity 1
16 atoms
O  1.411533 -0.998159 -0.535123
O  -0.567834 -2.216297 -0.528064
N  -1.666624 0.879075 1.877494
C  0.556223 1.23162 -0.909056
C  1.823338 0.45233 -0.456384
C  -0.624171 0.302141 -0.507108
C  0.018503 -1.128564 -0.514153
C  2.312196 0.758807 0.961809
C  -1.201135 0.611187 0.812008
H  0.555781 1.355157 -2.005323
H  0.498071 2.226969 -0.442714
H  2.645107 0.545483 -1.184821
H  -1.441219 0.307543 -1.249335
H  3.104083 0.048564 1.252805
H  2.731243 1.780896 1.000927
H  1.494607 0.690849 1.700538
