program: Gaussian 09
title: 000278451
version: EM64L-G09RevD.01
frameworkgroup: C1[X(C7H13NO3)]
method: RPBEPBE
basis: SDD
operation: Freq
keyword: #p
keyword: freq=noraman
keyword: PBEPBE/SDD
title: #p freq=noraman PBEPBE/SDD
converged: YES YES NO NO
title: Mulliken charges:
elementType: O O O N C C C C C C C H H H H H H H H H H H H H
charge: -0.270705 -0.296963 -0.310607 -0.644746 -0.239651 -0.218237 0.407910 -0.682805 -0.496730 -0.677464 0.283328 0.207563 0.289831 0.220337 0.217870 0.213851 0.232182 0.218461 0.230933 0.205142 0.226452 0.226090 0.330829 0.327129
chargesum: 0.00000
title: Mulliken charges with hydrogens summed into heavy atoms:
elementType: O O O N C C C C C C C
charge: -0.270705 -0.296963 -0.310607 0.013211 0.257743 0.219970 0.407910 -0.018311 -0.265797 -0.019779 0.283328
polarizability: 1.43595826e+02 9.08600447e+00 1.03045537e+02 -9.58504498e-01 3.86345624e+00 6.40185486e+01
1716.lowfreq: -6.9795 0.0005 0.0009 0.0012 3.2476 7.2502 35.7002 53.9367 75.8450
frequency: 35.5234 53.9035 75.8370 93.6569 114.8366 135.9724 177.9097 195.9081 220.5368 253.2559 255.1101 310.8668 337.8455 380.3582 431.3118 450.8605 478.2226 523.3056 646.1949 689.8890 725.7817 771.9797 797.1097 799.8506 807.1988 843.9871 922.2652 984.2311 1018.8548 1042.9755 1078.3453 1109.2417 1111.8331 1123.5425 1136.6386 1143.3857 1245.9457 1246.9876 1315.8390 1333.2728 1364.5111 1394.7309 1398.6146 1420.3574 1461.4274 1462.6402 1475.7209 1478.7914 1489.2771 1498.3719 1595.7879 1605.6113 1627.7795 2991.4295 2991.7024 2999.1631 3001.0056 3054.0665 3080.1663 3088.0394 3090.8512 3101.4282 3107.8333 3163.0788 3555.4944 3708.5153
redmass: 2.7446 2.4381 2.9713 2.8126 4.2844 2.5345 3.6003 2.8036 2.6521 1.4489 1.4193 4.6033 3.7066 3.4348 1.3787 1.1773 2.2478 4.2263 6.6381 3.0301 6.5975 3.2470 1.5552 1.1573 1.1167 3.4503 4.5159 2.5354 2.3419 4.1933 2.5346 2.0890 2.1938 1.7870 1.4638 1.4954 1.1370 1.1255 2.3040 1.3920 1.6732 1.2597 1.2807 2.0485 1.0415 1.0409 1.0542 1.0495 1.0738 1.0905 3.1670 2.0374 3.6180 1.0362 1.0358 1.0574 1.0632 1.1064 1.1018 1.0985 1.0977 1.1019 1.1030 1.0888 1.0448 1.1048
irintensity: 0.9120 0.1852 1.0265 3.0782 3.3672 11.0233 5.1274 0.9913 2.0474 1.6909 3.4397 8.9868 6.2064 9.8275 201.5614 8.9789 98.9676 2.5141 7.8817 10.5769 9.3492 19.3773 74.4645 1.6414 3.9918 2.4541 26.3458 94.5720 98.1879 342.4822 128.9244 29.0007 5.1851 126.8056 5.8397 6.6264 0.1184 11.4747 169.5552 13.0262 15.3720 31.4349 23.6055 79.8638 12.6036 10.8436 9.0157 14.8182 12.1434 15.3100 250.6807 79.6659 874.8923 37.8510 13.6042 29.1710 23.0414 15.4423 15.0698 36.4640 23.0202 50.8916 33.0937 5.1472 102.0630 33.8235
temp: 298.150 k
press: 1.00000 atm
elementType: 8 8 8 7 6 6 6 6 6 6 6 1 1 1 1 1 1 1 1 1 1 1 1 1
symmnumber: 1
zpe: 518144.3 jmol-1
zpe.correction: 0.197351 hartree
zpe.thermalcorrener: 0.210693 hartree
zpe.thermalcorrenthalpy: 0.211637 hartree
zpe.thermalcorrgfe: 0.156778 hartree
zpe.sumelectzpe: -554.074563 hartree
zpe.sumelectthermal: -554.061221 hartree
zpe.sumelectthermalent: -554.060277 hartree
zpe.sumelectthermalfe: -554.115136 hartree
dipole: 1.6874 1.9705 1.3233
dipole: 2.9123
quadrupole: -54.5074 -55.4348 -69.6852
quadrupole: 5.4852 2.3790 -3.0778
quadrupole: 5.3684 4.4410 -9.8094 5.4852 2.3790 -3.0778
hfenergy: -554.271914 hartree
pointgroup: C01 [X(C7H13N1O3)]
dipole: 0.66669 0.8708136 0.3317107 debye
dipolederiv: -0.9176388 0.3843941 -0.0628539 0.8058643 -1.1019833 0.1914234 0.1083052 0.1513148 -0.3466597 -1.9572651 -0.2154924 0.281116 -0.0414142 -0.4513519 -0.0350391 0.4240596 0.0028187 -0.3805894 -0.742328 0.0373195 0.045794 -0.0628856 -1.0519345 -0.1828854 0.0409733 -0.2175483 -0.4279078 -0.7315808 -0.4575879 0.1364017 -0.7056375 -1.1926528 0.118188 0.1535236 0.0361318 -0.7078755 0.2120408 -0.0836231 0.0223213 -0.4650552 0.7062207 -0.1746866 0.2041963 -0.2222175 0.3919214 0.9071864 0.1842551 -0.0523521 0.3964466 0.3734331 -0.0764864 -0.012489 -0.0420663 0.3480242 2.080646 0.3054323 -0.1917267 0.1047002 1.5476253 -0.2417716 -0.5670804 -0.1922742 0.2990143 -0.0764042 0.1085004 -0.0130954 0.1204973 -0.0127534 0.0330537 -0.0387293 0.0562287 0.058567 -1.478709 -0.5807721 0.0693659 -0.5088431 -0.5108581 0.1158631 0.1117764 0.1062516 -0.4114386 -0.1179676 0.038341 0.0549413 0.0086575 0.0486848 -0.0097958 0.0476878 -0.0149087 0.0497858 2.2089041 0.3345363 -0.3220963 0.4643077 1.3260666 0.2203681 -0.4574261 0.2169528 0.4198465 0.0425664 0.0179045 0.0920887 0.0671319 -0.0361697 -0.0595723 0.028393 0.0217898 -0.1118454 0.1446199 -0.1113344 -0.0038476 0.0001757 0.0070583 0.0136795 -0.0377504 -0.0073806 0.0482259 -0.0438009 -0.024564 0.0278091 -0.1004599 0.0200881 -0.0363638 -0.0416999 -0.0777249 -0.1311597 -0.0595604 0.0512547 -0.033492 -0.0597838 -0.0972214 0.0951927 -0.0231554 0.0969804 0.0021619 0.0677842 -0.0104197 0.015123 0.0241733 -0.0905013 0.1122707 -0.0059643 0.1163804 0.0486497 0.0437953 0.0320535 0.0493068 -0.0037819 0.1051477 -0.0365666 0.1022787 -0.0667053 -0.1021307 -0.0520381 -0.042359 -0.0753994 -0.1338208 0.0117846 -0.0882081 -0.0718684 -0.0726652 0.0423141 0.0649002 0.0515055 0.0200901 0.0065811 -0.0585627 -0.0413841 0.0855535 -0.0113903 0.1801411 -0.1050623 -0.1167251 0.0103627 -0.1502332 -0.0316771 -0.0119742 0.0025201 -0.0185456 0.1042818 0.0974956 -0.0045333 -0.040665 0.0409336 0.0776248 -0.0752362 0.0133208 -0.0676632 -0.135195 0.0797419 0.0440676 -0.0210953 0.1122252 -0.0550255 0.0955212 -0.0398327 0.1122525 0.0148317 0.2158889 0.0602965 -0.0071566 -0.0125872 0.2135304 0.0386143 -0.060947 0.0194812 0.3774465 0.1167855 -0.00245 -0.0009404 0.0928081 0.2534272 0.0357955 0.0343547 0.0745074 0.3695898 unknown
polarizability: 142.3948732|9.5546097|103.6589415|-7.9445068|-3.8134096|64.606097 unknown
InChI: InChI=1S/C7H13NO3/c1-3-10-6(8)5-7(9)11-4-2/h5H,3-4,8H2,1-2H3
charge 0 multiplicity 1
24 atoms
O  2.393463 0.202758 -0.474558
O  -2.070835 0.353242 0.271784
O  -0.529537 -1.172693 -0.60688
N  2.083661 2.432008 -0.614061
C  2.232053 -1.060258 0.31574
C  -3.097551 -0.715384 0.160009
C  1.462953 1.220103 -0.370447
C  3.615113 -1.698948 0.382551
C  0.104226 1.144934 -0.068016
C  -4.407214 -0.120939 0.672506
C  -0.769309 -0.005575 -0.171407
H  1.843746 -0.787618 1.316204
H  1.483011 -1.685913 -0.194208
H  -3.166686 -1.036702 -0.895989
H  -2.772043 -1.588338 0.755858
H  3.551657 -2.655764 0.93282
H  3.994952 -1.911587 -0.631657
H  4.340054 -1.046092 0.899424
H  -0.392747 2.084469 0.188633
H  -5.212547 -0.876438 0.616589
H  -4.306463 0.203955 1.722577
H  -4.706022 0.752376 0.067234
H  3.099885 2.465639 -0.651685
H  1.537881 3.253466 -0.85692
