program: Gaussian 09
title: 000278470
version: EM64L-G09RevD.01
frameworkgroup: C1[X(C15H15NO)]
method: RPBEPBE
basis: SDD
operation: Freq
keyword: #p
keyword: freq=noraman
keyword: PBEPBE/SDD
title: #p freq=noraman PBEPBE/SDD
converged: YES YES NO NO
title: Mulliken charges:
elementType: O N C C C C C C C C C C C C C C C H H H H H H H H H H H H H H H
charge: -0.440836 -0.625096 0.352278 0.290907 -0.482470 -0.588054 0.237453 -0.404344 -0.399293 0.124086 -0.381943 -0.228527 -0.238437 -0.357858 -0.252038 -0.240568 -0.208202 0.249169 0.235136 0.243430 0.297186 0.237565 0.238589 0.223915 0.225112 0.250500 0.226883 0.228144 0.228793 0.279764 0.308549 0.370205
chargesum: 0.00000
title: Mulliken charges with hydrogens summed into heavy atoms:
elementType: O N C C C C C C C C C C C C C C C
charge: -0.070631 -0.036783 0.352278 0.290907 -0.233301 -0.109488 0.237453 -0.107158 -0.161727 0.124086 -0.143354 -0.004612 -0.013325 -0.107358 -0.025154 -0.012424 0.020591
polarizability: 2.74991086e+02 7.85699262e+00 1.69351649e+02 -7.03466795e+00 -8.42194103e+00 9.09126005e+01
1716.lowfreq: -7.0194 -1.2414 -0.0007 -0.0005 -0.0005 1.2969 21.4146 46.8862 66.2974
frequency: 21.3678 46.8587 66.2803 88.8230 117.5028 128.2304 166.9111 190.0659 242.1255 250.9239 277.0020 289.3439 329.3799 362.0430 406.2537 425.2572 468.8607 509.0202 521.6164 544.5238 569.2339 577.8377 613.6477 636.8008 653.0788 690.0451 706.1518 731.2549 753.1445 759.9507 766.3196 779.1940 846.2009 858.6802 861.3191 872.4298 888.4361 936.5136 944.2503 977.9119 983.0292 988.9503 1003.1853 1009.4181 1028.0137 1030.7825 1074.3900 1080.7126 1093.8249 1152.6929 1161.1272 1167.6014 1172.0309 1189.4468 1197.5186 1233.6360 1267.3600 1301.9286 1310.2726 1318.9433 1331.3241 1363.7460 1374.5894 1381.2085 1432.8435 1447.6226 1467.9484 1473.6381 1480.6691 1575.7847 1580.4377 1608.1372 1614.9403 1630.2739 1648.8442 2954.6810 3037.2534 3083.1135 3120.2711 3126.1443 3127.1477 3138.1076 3139.8460 3148.0961 3157.9059 3162.2163 3172.4160 3448.0080 3463.4534 3593.2388
redmass: 4.0190 4.6179 4.3028 4.5058 3.8774 3.3545 5.3003 2.3058 4.0623 1.5766 3.9661 3.7135 3.4140 3.6918 2.9037 3.5700 3.6503 3.8706 3.9634 3.9344 4.9183 1.1886 5.5586 4.8738 3.5868 1.4604 1.8571 2.8185 4.1469 1.4576 1.9010 3.0849 3.2710 1.5112 1.2700 1.5819 1.6748 1.4340 1.3894 1.3125 1.7413 2.9732 3.0881 1.4366 2.1732 2.0575 2.3760 1.9015 1.9340 1.2887 1.3858 1.1056 1.0539 1.1376 2.6263 1.7542 2.2754 1.7000 1.3421 1.3317 1.5998 1.4161 4.8638 4.4845 2.2965 2.5335 1.2981 1.9376 2.3413 5.9577 6.0003 6.0171 6.8848 5.0972 1.1679 1.0650 1.0965 1.0881 1.0846 1.0864 1.0877 1.0898 1.0927 1.0961 1.0950 1.1016 1.0993 1.0644 1.0467 1.0980
irintensity: 1.1825 0.1509 0.2073 0.5037 2.2749 6.0744 1.5177 17.3415 0.9242 77.2701 3.2386 0.8821 15.0318 2.6159 0.6742 4.4630 8.8744 4.9991 6.9320 2.0013 1.9162 169.4912 4.6000 1.0581 14.4569 71.9981 40.3704 30.9212 5.9894 73.5566 32.3012 59.2192 4.6684 13.9360 4.1235 7.4534 10.5837 1.8254 4.2139 0.0728 0.2596 0.1979 4.4411 1.6079 13.4499 8.0214 25.1316 6.0094 0.4327 1.3455 122.6733 17.3317 0.4277 5.2733 16.6528 1.0093 0.7324 25.3187 14.3735 9.0212 3.1018 10.2781 8.0209 20.7016 3.7479 16.4443 18.4775 33.4833 35.8554 14.8023 8.1421 7.3043 11.7120 6.2085 46.2204 43.4073 28.4453 20.7530 2.5111 2.7827 5.9675 12.2191 16.8269 18.3468 25.4049 42.5695 19.0734 81.5976 22.7902 11.0411
temp: 298.150 k
press: 1.00000 atm
elementType: 8 7 6 6 6 6 6 6 6 6 6 6 6 6 6 6 6 1 1 1 1 1 1 1 1 1 1 1 1 1 1 1
symmnumber: 1
zpe: 681414.2 jmol-1
zpe.correction: 0.259537 hartree
zpe.thermalcorrener: 0.274747 hartree
zpe.thermalcorrenthalpy: 0.275691 hartree
zpe.thermalcorrgfe: 0.216229 hartree
zpe.sumelectzpe: -709.340496 hartree
zpe.sumelectthermal: -709.325286 hartree
zpe.sumelectthermalent: -709.324342 hartree
zpe.sumelectthermalfe: -709.383803 hartree
dipole: 0.5175 -0.3201 1.4643
dipole: 1.5857
quadrupole: -91.5557 -90.6286 -104.0442
quadrupole: 1.3238 -2.5665 3.0088
quadrupole: 3.8538 4.7809 -8.6347 1.3238 -2.5665 3.0088
hfenergy: -709.6000327 hartree
pointgroup: C01 [X(C15H15N1O1)]
dipole: -0.2323061 -0.5668303 0.1180407 debye
polarizability: 273.3026741|-14.2560973|91.7661997|11.7829367|-9.1243828|170.1864617 unknown
InChI: InChI=1S/C15H15NO/c16-11-14(12-6-2-1-3-7-12)10-13-8-4-5-9-15(13)17/h1-10,17H,11,16H2
charge 0 multiplicity 1
32 atoms
O  1.919682 1.074267 -1.482805
N  -0.213694 -0.732715 -2.554482
C  -0.587825 -0.353672 -0.07622
C  -2.044497 -0.063594 0.102855
C  0.341438 0.166532 0.793273
C  -0.186867 -1.330935 -1.194504
C  1.819571 -0.022931 0.730108
C  -2.896997 0.083335 -1.027855
C  -2.619475 0.046904 1.401359
C  2.558923 0.438151 -0.400826
C  2.548853 -0.581255 1.811655
C  -4.274002 0.346677 -0.862573
C  -3.996292 0.309861 1.564036
C  3.962071 0.300885 -0.470653
C  3.951916 -0.728061 1.753737
C  -4.831043 0.4637 0.432161
C  4.655844 -0.292098 0.605008
H  -0.017537 0.807518 1.612284
H  -0.914766 -2.16334 -1.178681
H  0.804113 -1.763056 -0.943055
H  -2.44707 0.021595 -2.024298
H  -1.991017 -0.108401 2.285942
H  1.998361 -0.921562 2.696615
H  -4.912212 0.468366 -1.7454
H  -4.420734 0.382009 2.571957
H  4.485802 0.675255 -1.355349
H  4.491482 -1.176743 2.594269
H  -5.900494 0.666337 0.5589
H  5.74478 -0.399908 0.551752
H  -0.552675 -1.363771 -3.284329
H  0.66029 -0.265128 -2.815234
H  0.963866 1.236974 -1.250747
