program: Gaussian 09
title: 000278444
version: EM64L-G09RevD.01
frameworkgroup: C1[X(C12H9NO)]
method: RPBEPBE
basis: SDD
operation: Freq
keyword: #p
keyword: freq=noraman
keyword: PBEPBE/SDD
title: #p freq=noraman PBEPBE/SDD
converged: NO YES NO NO
title: Mulliken charges:
elementType: O N C C C C C C C C C C C C H H H H H H H H H
charge: -0.426176 -0.019778 0.248445 0.449691 -0.043418 0.308533 -0.477909 -0.322584 -0.503511 -0.417182 0.398679 -0.403828 -0.810902 -0.273882 0.243388 0.236997 0.211053 0.249169 0.260008 0.272023 0.229300 0.229136 0.362750
chargesum: 0.00000
title: Mulliken charges with hydrogens summed into heavy atoms:
elementType: O N C C C C C C C C C C C C
charge: -0.063426 -0.019778 0.248445 0.449691 -0.043418 0.308533 -0.234521 -0.085587 -0.292458 -0.168014 0.398679 -0.143821 -0.080444 -0.273882
polarizability: 2.44120546e+02 1.11306121e+01 1.44099226e+02 -2.21820588e-02 8.02618792e-03 5.80639651e+01
1716.lowfreq: -72.2187 -6.5428 -3.5843 -0.0007 -0.0006 0.0005 7.2824 58.3790 112.6604
frequency: -72.1987 58.3736 112.6592 119.7555 137.3823 224.9964 252.3197 265.6891 303.2503 320.2129 375.3951 411.1674 434.2823 464.2407 468.6834 553.7921 556.9758 568.8396 585.6495 662.6034 681.0219 705.4843 758.5001 772.7456 804.7938 865.8187 875.3869 880.9387 950.4541 961.8897 985.4445 1007.5633 1046.1539 1071.6688 1154.0829 1166.9263 1179.5166 1213.1039 1240.5793 1273.7195 1286.4216 1335.4245 1396.7864 1411.3653 1420.0370 1425.3850 1459.6561 1468.6680 1481.8306 1519.5796 1572.0552 1610.8251 1637.4670 2171.7140 2983.8439 3056.2587 3111.2884 3122.3147 3126.0007 3137.1116 3151.8037 3170.0726 3598.7654
redmass: 1.0191 3.9327 3.0789 8.8306 3.4345 1.7493 3.8051 3.9717 4.0110 4.2151 7.6679 3.1127 6.2626 4.5053 4.6691 3.4864 5.5087 7.5988 4.2936 6.4071 3.6589 6.4552 5.8149 2.5887 1.3464 1.6368 4.9687 1.7594 2.4548 1.3175 1.3948 1.6221 1.5072 2.9412 1.3809 1.2593 2.5597 2.1613 1.8329 2.1157 1.9262 2.4291 1.3310 3.2397 4.8427 4.0547 2.8907 1.1390 1.0457 3.6544 7.1733 6.0424 6.5043 12.6290 1.0395 1.0974 1.0909 1.0957 1.0881 1.0889 1.0972 1.0972 1.0656
irintensity: 1.5654 9.4343 10.7539 3.8362 3.4312 80.8491 15.1363 0.9940 4.3365 5.4096 0.1915 18.9412 1.9752 1.7483 3.9501 3.3556 12.1506 0.6490 16.4772 0.5422 0.3801 8.5940 8.6330 0.7957 1.3911 74.0944 4.0585 34.7842 8.3174 0.7779 0.9406 23.0473 5.6533 100.5063 56.6734 22.5172 41.9989 32.7679 3.0035 15.1161 13.1582 33.0795 25.4173 6.0606 36.7069 42.0740 9.1367 18.9678 16.4591 13.3954 18.7310 7.2517 4.9787 63.6637 31.5990 19.7299 10.3335 4.4132 6.6186 3.9290 20.5226 7.2539 22.5636
temp: 298.150 k
press: 1.00000 atm
elementType: 8 7 6 6 6 6 6 6 6 6 6 6 6 6 1 1 1 1 1 1 1 1 1
symmnumber: 1
zpe: 455339.0 jmol-1
zpe.correction: 0.173429 hartree
zpe.thermalcorrener: 0.184759 hartree
zpe.thermalcorrenthalpy: 0.185703 hartree
zpe.thermalcorrgfe: 0.136150 hartree
zpe.sumelectzpe: -591.691992 hartree
zpe.sumelectthermal: -591.680662 hartree
zpe.sumelectthermalent: -591.679718 hartree
zpe.sumelectthermalfe: -591.729271 hartree
dipole: 3.8850 2.1053 0.0038
dipole: 4.4188
quadrupole: -97.5551 -72.6142 -85.0423
quadrupole: -5.9269 0.0109 -0.0075
quadrupole: -12.4846 12.4563 0.0283 -5.9269 0.0109 -0.0075
hfenergy: -591.865421 hartree
pointgroup: C01 [X(C12H9N1O1)]
dipole: -1.5620965 0.7588073 -0.0800006 debye
dipolederiv: -0.0786671 0.1218032 -0.003126 -0.1620409 -1.3102893 0.0578652 0.015839 0.0634928 -0.4020404 -0.5651285 0.0594848 -0.0098604 0.1593414 -0.2520727 0.0032934 -0.0162211 0.0014046 -0.2471612 -0.0341724 -0.0672877 0.0037205 0.3696462 -0.2444621 0.0235331 -0.0253096 0.0157562 0.0080786 0.2837124 0.0509889 0.0004035 -0.3835003 -0.0975285 0.0041411 0.0293902 0.0118613 0.0671497 -0.1758287 -0.2842706 0.0149622 0.1640391 1.1869608 -0.0724235 -0.0151691 -0.0803427 0.0605247 0.415105 0.4483564 -0.0210413 0.0861486 -0.2292231 0.0123291 0.0030902 0.0183104 -0.0703585 -0.3971081 -0.1298233 0.0053188 -0.068082 0.0284288 -0.0169666 0.0010271 -0.0178777 -0.2062443 0.10499 -0.0575641 0.0082496 0.0321074 0.2259044 -0.0242534 0.0023237 -0.0256506 -0.1418491 0.1645796 -0.0631875 0.0100413 0.0006022 -0.0081369 -0.0105104 0.0057134 -0.0114068 -0.165213 -0.0962344 -0.0746063 0.0058613 0.0576746 0.1523956 -0.0189555 -0.0029482 -0.0212191 -0.1450717 -0.2434421 0.0293952 -0.0084782 0.0910796 0.1928899 -0.0031172 -0.0127912 -0.004311 0.1230426 -0.0335056 0.1386693 -0.0068539 -0.1284286 0.0141017 -0.014715 0.0111115 -0.0100159 -0.1702177 -0.1755467 -0.0972605 0.0018323 -0.0063279 -0.0098287 0.0055082 -0.0036709 0.0039376 0.0771376 0.5907027 -0.1615681 0.0211606 -0.2728034 0.0010074 -0.0039402 0.0285554 -0.0019153 0.016046 0.0677013 -0.0327268 0.0004074 0.0339332 -0.0979859 0.018186 -0.0039617 0.0169481 0.1651033 -0.0923196 0.0842974 -0.0099653 0.0692866 0.0687644 0.0064017 -0.0089842 0.0067901 0.1455908 0.0866504 -0.0265289 0.0004615 0.0161969 -0.1099163 0.0181646 -0.0023313 0.0173163 0.1572087 0.0696009 0.0519592 -0.0049749 -0.0026971 -0.0830518 0.0158455 -0.0012948 0.0167725 0.1536637 -0.016745 -0.0804688 0.0020853 -0.0560213 0.05537 0.0066959 0.0003885 0.0062946 0.1695248 0.1145404 0.0620365 -0.0040335 -0.0420166 -0.0596131 0.0105912 0.0024428 0.012461 0.1185238 -0.034468 -0.0106809 0.0897379 0.0023344 0.0734423 -0.0762171 0.1386097 -0.0330793 -0.0298203 -0.0262127 -0.0228406 -0.087104 -0.0175083 0.0853028 0.0608667 -0.1373325 0.0171844 -0.0498727 0.0717962 0.0618232 -0.0088047 0.0570361 0.4175405 -0.0023226 -0.008477 -0.0027116 0.3662546 unknown
polarizability: 244.8274319|-6.5990182|142.9395203|3.7592619|-5.7828992|58.5167846 unknown
InChI: InChI=1S/C12H9NO/c1-8-2-4-10-5-3-9(7-13)6-11(10)12(8)14/h2-6,14H,1H3
charge 0 multiplicity 1
23 atoms
O  -1.427601 -2.365113 0.167141
N  4.620977 -1.138754 0.192291
C  -0.217388 -0.191317 0.044351
C  -0.313456 1.253252 -0.054272
C  -1.43946 -0.963087 0.073709
C  -2.70263 -0.350427 0.009983
C  -1.602878 1.86549 -0.118145
C  -2.753795 1.076659 -0.086207
C  1.078836 -0.789639 0.107478
C  0.893341 2.028157 -0.084844
C  2.244735 -0.003971 0.075443
C  2.14686 1.428113 -0.022472
C  -3.982114 -1.162024 0.039695
C  3.539941 -0.627344 0.139839
H  -1.675045 2.955778 -0.191977
H  -3.741417 1.55069 -0.135959
H  1.208365 -1.876902 0.18226
H  0.811418 3.118377 -0.159131
H  3.062838 2.025468 -0.046345
H  -3.771691 -2.238946 0.11214
H  -4.611459 -0.872604 0.902309
H  -4.580232 -0.985712 -0.874102
H  -0.510442 -2.729842 0.205815
